php-ext.com / apcu_bc (from pecl using PHP 8.0.5-buster)

Dockerfile
FROM php:8.0.5-buster
WORKDIR /tmp
RUN apt update && \
    apt install -y --no-install-recommends git subversion autoconf build-essential && \
    rm -rf /var/lib/apt/lists/*
RUN pecl install --force apcu_bc && \
    pecl run-tests apcu_bc
Build output FAIL 15ss
Step 1/4 : FROM php:8.0.5-buster
---> 9d3d64fb1730
Step 2/4 : WORKDIR /tmp
---> Running in 595d68f479f3
Removing intermediate container 595d68f479f3
---> 045073a23e94
Step 3/4 : RUN apt update && apt install -y --no-install-recommends git subversion autoconf build-essential && rm -rf /var/lib/apt/lists/*
---> Running in ba3bfc149db7


WARNING: apt does not have a stable CLI interface. Use with caution in scripts.


Get:1 http://security.debian.org/debian-security buster/updates InRelease [65.4 kB]
Get:2 http://deb.debian.org/debian buster InRelease [121 kB]
Get:3 http://deb.debian.org/debian buster-updates InRelease [51.9 kB]
Get:4 http://security.debian.org/debian-security buster/updates/main amd64 Packages [285 kB]
Get:5 http://deb.debian.org/debian buster/main amd64 Packages [7907 kB]
Get:6 http://deb.debian.org/debian buster-updates/main amd64 Packages [10.9 kB]
Fetched 8441 kB in 1s (5880 kB/s)
Reading package lists...
Building dependency tree...
Reading state information...
2 packages can be upgraded. Run 'apt list --upgradable' to see them.


WARNING: 
apt
 
does not have a stable CLI interface. 
Use with caution in scripts.




Reading package lists...
Building dependency tree...
Reading state information...
autoconf is already the newest version (2.69-11).
The following package was automatically installed and is no longer required:
lsb-base
Use 'apt autoremove' to remove it.
The following additional packages will be installed:
git-man libapr1 libaprutil1 libcurl3-gnutls liberror-perl libexpat1
libpcre2-8-0 libserf-1-1 libsvn1 libutf8proc2
Suggested packages:
gettext-base git-daemon-run | git-daemon-sysvinit git-doc git-el git-email
git-gui gitk gitweb git-cvs git-mediawiki git-svn db5.3-util
libapache2-mod-svn subversion-tools
Recommended packages:
less ssh-client
The following NEW packages will be installed:
build-essential git git-man libapr1 libaprutil1 libcurl3-gnutls
liberror-perl libexpat1 libpcre2-8-0 libserf-1-1 libsvn1 libutf8proc2
subversion
0 upgraded, 13 newly installed, 0 to remove and 2 not upgraded.
Need to get 10.7 MB of archives.
After this operation, 50.2 MB of additional disk space will be used.
Get:1 http://security.debian.org/debian-security buster/updates/main amd64 libcurl3-gnutls amd64 7.64.0-4+deb10u2 [330 kB]
Get:2 http://deb.debian.org/debian buster/main amd64 build-essential amd64 12.6 [7576 B]
Get:3 http://deb.debian.org/debian buster/main amd64 libexpat1 amd64 2.2.6-2+deb10u1 [106 kB]
Get:4 http://deb.debian.org/debian buster/main amd64 libpcre2-8-0 amd64 10.32-5 [213 kB]
Get:5 http://deb.debian.org/debian buster/main amd64 liberror-perl all 0.17027-2 [30.9 kB]
Get:6 http://deb.debian.org/debian buster/main amd64 git-man all 1:2.20.1-2+deb10u3 [1620 kB]
Get:7 http://deb.debian.org/debian buster/main amd64 git amd64 1:2.20.1-2+deb10u3 [5633 kB]
Get:8 http://deb.debian.org/debian buster/main amd64 libapr1 amd64 1.6.5-1+b1 [102 kB]
Get:9 http://deb.debian.org/debian buster/main amd64 libaprutil1 amd64 1.6.1-4 [91.8 kB]
Get:10 http://deb.debian.org/debian buster/main amd64 libserf-1-1 amd64 1.3.9-7+b10 [53.6 kB]
Get:11 http://deb.debian.org/debian buster/main amd64 libutf8proc2 amd64 2.3.0-1 [53.0 kB]
Get:12 http://deb.debian.org/debian buster/main amd64 libsvn1 amd64 1.10.4-1+deb10u2 [1403 kB]
Get:13 http://deb.debian.org/debian buster/main amd64 subversion amd64 1.10.4-1+deb10u2 [1008 kB]
debconf: delaying package configuration, since apt-utils is not installed

Fetched 10.7 MB in 0s (79.5 MB/s)
Selecting previously unselected package build-essential.
(Reading database ...
(Reading database ... 5%
(Reading database ... 10%
(Reading database ... 15%
(Reading database ... 20%
(Reading database ... 25%
(Reading database ... 30%
(Reading database ... 35%
(Reading database ... 40%
(Reading database ... 45%
(Reading database ... 50%
(Reading database ... 55%
(Reading database ... 60%
(Reading database ... 65%
(Reading database ... 70%
(Reading database ... 75%
(Reading database ... 80%
(Reading database ... 85%
(Reading database ... 90%
(Reading database ... 95%
(Reading database ... 100%
(Reading database ...
12690 files and directories currently installed.)
Preparing to unpack .../00-build-essential_12.6_amd64.deb ...
Unpacking build-essential (12.6) ...
Selecting previously unselected package libcurl3-gnutls:amd64.
Preparing to unpack .../01-libcurl3-gnutls_7.64.0-4+deb10u2_amd64.deb ...
Unpacking libcurl3-gnutls:amd64 (7.64.0-4+deb10u2) ...
Selecting previously unselected package libexpat1:amd64.
Preparing to unpack .../02-libexpat1_2.2.6-2+deb10u1_amd64.deb ...
Unpacking libexpat1:amd64 (2.2.6-2+deb10u1) ...
Selecting previously unselected package libpcre2-8-0:amd64.
Preparing to unpack .../03-libpcre2-8-0_10.32-5_amd64.deb ...
Unpacking libpcre2-8-0:amd64 (10.32-5) ...
Selecting previously unselected package liberror-perl.
Preparing to unpack .../04-liberror-perl_0.17027-2_all.deb ...
Unpacking liberror-perl (0.17027-2) ...
Selecting previously unselected package git-man.
Preparing to unpack .../05-git-man_1%3a2.20.1-2+deb10u3_all.deb ...
Unpacking git-man (1:2.20.1-2+deb10u3) ...
Selecting previously unselected package git.
Preparing to unpack .../06-git_1%3a2.20.1-2+deb10u3_amd64.deb ...
Unpacking git (1:2.20.1-2+deb10u3) ...
Selecting previously unselected package libapr1:amd64.
Preparing to unpack .../07-libapr1_1.6.5-1+b1_amd64.deb ...
Unpacking libapr1:amd64 (1.6.5-1+b1) ...
Selecting previously unselected package libaprutil1:amd64.
Preparing to unpack .../08-libaprutil1_1.6.1-4_amd64.deb ...
Unpacking libaprutil1:amd64 (1.6.1-4) ...
Selecting previously unselected package libserf-1-1:amd64.
Preparing to unpack .../09-libserf-1-1_1.3.9-7+b10_amd64.deb ...
Unpacking libserf-1-1:amd64 (1.3.9-7+b10) ...
Selecting previously unselected package libutf8proc2:amd64.
Preparing to unpack .../10-libutf8proc2_2.3.0-1_amd64.deb ...
Unpacking libutf8proc2:amd64 (2.3.0-1) ...
Selecting previously unselected package libsvn1:amd64.
Preparing to unpack .../11-libsvn1_1.10.4-1+deb10u2_amd64.deb ...
Unpacking libsvn1:amd64 (1.10.4-1+deb10u2) ...
Selecting previously unselected package subversion.
Preparing to unpack .../12-subversion_1.10.4-1+deb10u2_amd64.deb ...
Unpacking subversion (1.10.4-1+deb10u2) ...
Setting up libexpat1:amd64 (2.2.6-2+deb10u1) ...
Setting up libutf8proc2:amd64 (2.3.0-1) ...
Setting up libapr1:amd64 (1.6.5-1+b1) ...
Setting up libcurl3-gnutls:amd64 (7.64.0-4+deb10u2) ...
Setting up liberror-perl (0.17027-2) ...
Setting up libpcre2-8-0:amd64 (10.32-5) ...
Setting up build-essential (12.6) ...
Setting up git-man (1:2.20.1-2+deb10u3) ...
Setting up libaprutil1:amd64 (1.6.1-4) ...
Setting up libserf-1-1:amd64 (1.3.9-7+b10) ...
Setting up git (1:2.20.1-2+deb10u3) ...
Setting up libsvn1:amd64 (1.10.4-1+deb10u2) ...
Setting up subversion (1.10.4-1+deb10u2) ...
Processing triggers for libc-bin (2.28-10) ...
Removing intermediate container ba3bfc149db7
---> 2415afdc7151
Step 4/4 : RUN pecl install --force apcu_bc && pecl run-tests apcu_bc
---> Running in a520b1573388
downloading apcu_bc-1.0.5.tgz ...
Starting to download apcu_bc-1.0.5.tgz (7,415 bytes)
.
.
...done: 7,415 bytes
downloading apcu-5.1.20.tgz ...
Starting to download apcu-5.1.20.tgz (96,727 bytes)
...done: 96,727 bytes
42 source files, building
running: phpize
Configuring for:
PHP Api Version:         20200930
Zend Module Api No:      20200930
Zend Extension Api No:   420200930
Enable internal debugging in APCu
[no]
:
building in /tmp/pear/temp/pear-build-defaultuserMpf3RL/apcu-5.1.20
running: /tmp/pear/temp/apcu/configure --with-php-config=/usr/local/bin/php-config --enable-apcu-debug=no
checking for grep that handles long lines and -e... /bin/grep
checking for egrep... /bin/grep -E
checking for a sed that does not truncate output... /bin/sed
checking for pkg-config... /usr/bin/pkg-config
checking pkg-config is at least version 0.9.0... yes
checking for cc... cc
checking whether the C compiler works... yes
checking for C compiler default output file name... a.out
checking for suffix of executables...
checking whether we are cross compiling... no
checking for suffix of object files... o
checking whether we are using the GNU C compiler... yes
checking whether cc accepts -g... yes
checking for cc option to accept ISO C89... none needed
checking how to run the C preprocessor... cc -E
checking for icc... no
checking for suncc... no
checking for system library directory... lib
checking if compiler supports -R... no
checking if compiler supports -Wl,-rpath,... yes
checking build system type... x86_64-pc-linux-gnu
checking host system type... x86_64-pc-linux-gnu
checking target system type... x86_64-pc-linux-gnu
checking for PHP prefix... /usr/local
checking for PHP includes... -I/usr/local/include/php -I/usr/local/include/php/main -I/usr/local/include/php/TSRM -I/usr/local/include/php/Zend -I/usr/local/include/php/ext -I/usr/local/include/php/ext/date/lib
checking for PHP extension directory... /usr/local/lib/php/extensions/no-debug-non-zts-20200930
checking for PHP installed headers prefix... /usr/local/include/php
checking if debug is enabled... no
checking if zts is enabled... no
checking for gawk... no
checking for nawk... nawk
checking if nawk is broken... no
checking whether to enable APCu support... yes, shared
checking if APCu should be allowed to use rwlocks... yes
checking if APCu should be built in debug mode... no
checking if APCu should clear on SIGUSR1... no
checking if APCu will use mmap (or shm)... yes
checking if APCu should utilize spinlocks before flocks... no
checking whether the target compiler supports builtin atomics... yes
checking for pthread rwlocks... yes
checking for pthread mutexes... yes
checking for sigaction... yes
checking for union semun... no
checking for ANSI C header files... yes
checking for sys/types.h... yes
checking for sys/stat.h... yes
checking for stdlib.h... yes
checking for string.h... yes
checking for memory.h... yes
checking for strings.h... yes
checking for inttypes.h... yes
checking for stdint.h... yes
checking for unistd.h... yes
checking valgrind/memcheck.h usability... no
checking valgrind/memcheck.h presence... no
checking for valgrind/memcheck.h... no
checking for shm_open in -lrt... yes
checking whether to include code coverage symbols... no
checking for a sed that does not truncate output... /bin/sed
checking for ld used by cc... /usr/bin/ld
checking if the linker (/usr/bin/ld) is GNU ld... yes
checking for /usr/bin/ld option to reload object files... -r
checking for BSD-compatible nm... /usr/bin/nm -B
checking whether ln -s works... yes
checking how to recognize dependent libraries... pass_all
checking dlfcn.h usability... yes
checking dlfcn.h presence... yes
checking for dlfcn.h... yes
checking the maximum length of command line arguments... 1572864
checking command to parse /usr/bin/nm -B output from cc object... ok
checking for objdir... .libs
checking for ar... ar
checking for ranlib... ranlib
checking for strip... strip
checking if cc supports -fno-rtti -fno-exceptions... no
checking for cc option to produce PIC... -fPIC
checking if cc PIC flag -fPIC works... yes
checking if cc static flag -static works... yes
checking if cc supports -c -o file.o... yes
checking whether the cc linker (/usr/bin/ld -m elf_x86_64) supports shared libraries... yes
checking whether -lc should be explicitly linked in... no
checking dynamic linker characteristics... GNU/Linux ld.so
checking how to hardcode library paths into programs... immediate
checking whether stripping libraries is possible... yes
checking if libtool supports shared libraries... yes
checking whether to build shared libraries... yes
checking whether to build static libraries... no
creating libtool
appending configuration tag "CXX" to libtool
configure: patching config.h.in
configure: creating ./config.status
config.status: creating config.h
running: make
/bin/bash /tmp/pear/temp/pear-build-defaultuserMpf3RL/apcu-5.1.20/libtool --mode=compile cc -I. -I/tmp/pear/temp/apcu -I/tmp/pear/temp/pear-build-defaultuserMpf3RL/apcu-5.1.20/include -I/tmp/pear/temp/pear-build-defaultuserMpf3RL/apcu-5.1.20/main -I/tmp/pear/temp/apcu -I/usr/local/include/php -I/usr/local/include/php/main -I/usr/local/include/php/TSRM -I/usr/local/include/php/Zend -I/usr/local/include/php/ext -I/usr/local/include/php/ext/date/lib  -DHAVE_CONFIG_H  -g -O2   -D_GNU_SOURCE -DZEND_ENABLE_STATIC_TSRMLS_CACHE=1 -c /tmp/pear/temp/apcu/apc.c -o apc.lo
mkdir .libs
cc -I. -I/tmp/pear/temp/apcu -I/tmp/pear/temp/pear-build-defaultuserMpf3RL/apcu-5.1.20/include -I/tmp/pear/temp/pear-build-defaultuserMpf3RL/apcu-5.1.20/main -I/tmp/pear/temp/apcu -I/usr/local/include/php -I/usr/local/include/php/main -I/usr/local/include/php/TSRM -I/usr/local/include/php/Zend -I/usr/local/include/php/ext -I/usr/local/include/php/ext/date/lib -DHAVE_CONFIG_H -g -O2 -D_GNU_SOURCE -DZEND_ENABLE_STATIC_TSRMLS_CACHE=1 -c /tmp/pear/temp/apcu/apc.c  -fPIC -DPIC -o .libs/apc.o
/bin/bash /tmp/pear/temp/pear-build-defaultuserMpf3RL/apcu-5.1.20/libtool --mode=compile cc -I. -I/tmp/pear/temp/apcu -I/tmp/pear/temp/pear-build-defaultuserMpf3RL/apcu-5.1.20/include -I/tmp/pear/temp/pear-build-defaultuserMpf3RL/apcu-5.1.20/main -I/tmp/pear/temp/apcu -I/usr/local/include/php -I/usr/local/include/php/main -I/usr/local/include/php/TSRM -I/usr/local/include/php/Zend -I/usr/local/include/php/ext -I/usr/local/include/php/ext/date/lib  -DHAVE_CONFIG_H  -g -O2   -D_GNU_SOURCE -DZEND_ENABLE_STATIC_TSRMLS_CACHE=1 -c /tmp/pear/temp/apcu/apc_lock.c -o apc_lock.lo
cc -I. -I/tmp/pear/temp/apcu -I/tmp/pear/temp/pear-build-defaultuserMpf3RL/apcu-5.1.20/include -I/tmp/pear/temp/pear-build-defaultuserMpf3RL/apcu-5.1.20/main -I/tmp/pear/temp/apcu -I/usr/local/include/php -I/usr/local/include/php/main -I/usr/local/include/php/TSRM -I/usr/local/include/php/Zend -I/usr/local/include/php/ext -I/usr/local/include/php/ext/date/lib -DHAVE_CONFIG_H -g -O2 -D_GNU_SOURCE -DZEND_ENABLE_STATIC_TSRMLS_CACHE=1 -c /tmp/pear/temp/apcu/apc_lock.c  -fPIC -DPIC -o .libs/apc_lock.o
/bin/bash /tmp/pear/temp/pear-build-defaultuserMpf3RL/apcu-5.1.20/libtool --mode=compile cc -I. -I/tmp/pear/temp/apcu -I/tmp/pear/temp/pear-build-defaultuserMpf3RL/apcu-5.1.20/include -I/tmp/pear/temp/pear-build-defaultuserMpf3RL/apcu-5.1.20/main -I/tmp/pear/temp/apcu -I/usr/local/include/php -I/usr/local/include/php/main -I/usr/local/include/php/TSRM -I/usr/local/include/php/Zend -I/usr/local/include/php/ext -I/usr/local/include/php/ext/date/lib  -DHAVE_CONFIG_H  -g -O2   -D_GNU_SOURCE -DZEND_ENABLE_STATIC_TSRMLS_CACHE=1 -c /tmp/pear/temp/apcu/apc_mutex.c -o apc_mutex.lo
cc -I. -I/tmp/pear/temp/apcu -I/tmp/pear/temp/pear-build-defaultuserMpf3RL/apcu-5.1.20/include -I/tmp/pear/temp/pear-build-defaultuserMpf3RL/apcu-5.1.20/main -I/tmp/pear/temp/apcu -I/usr/local/include/php -I/usr/local/include/php/main -I/usr/local/include/php/TSRM -I/usr/local/include/php/Zend -I/usr/local/include/php/ext -I/usr/local/include/php/ext/date/lib -DHAVE_CONFIG_H -g -O2 -D_GNU_SOURCE -DZEND_ENABLE_STATIC_TSRMLS_CACHE=1 -c /tmp/pear/temp/apcu/apc_mutex.c  -fPIC -DPIC -o .libs/apc_mutex.o
/bin/bash /tmp/pear/temp/pear-build-defaultuserMpf3RL/apcu-5.1.20/libtool --mode=compile cc -I. -I/tmp/pear/temp/apcu -I/tmp/pear/temp/pear-build-defaultuserMpf3RL/apcu-5.1.20/include -I/tmp/pear/temp/pear-build-defaultuserMpf3RL/apcu-5.1.20/main -I/tmp/pear/temp/apcu -I/usr/local/include/php -I/usr/local/include/php/main -I/usr/local/include/php/TSRM -I/usr/local/include/php/Zend -I/usr/local/include/php/ext -I/usr/local/include/php/ext/date/lib  -DHAVE_CONFIG_H  -g -O2   -D_GNU_SOURCE -DZEND_ENABLE_STATIC_TSRMLS_CACHE=1 -c /tmp/pear/temp/apcu/php_apc.c -o php_apc.lo
cc -I. -I/tmp/pear/temp/apcu -I/tmp/pear/temp/pear-build-defaultuserMpf3RL/apcu-5.1.20/include -I/tmp/pear/temp/pear-build-defaultuserMpf3RL/apcu-5.1.20/main -I/tmp/pear/temp/apcu -I/usr/local/include/php -I/usr/local/include/php/main -I/usr/local/include/php/TSRM -I/usr/local/include/php/Zend -I/usr/local/include/php/ext -I/usr/local/include/php/ext/date/lib -DHAVE_CONFIG_H -g -O2 -D_GNU_SOURCE -DZEND_ENABLE_STATIC_TSRMLS_CACHE=1 -c /tmp/pear/temp/apcu/php_apc.c  -fPIC -DPIC -o .libs/php_apc.o
/bin/bash /tmp/pear/temp/pear-build-defaultuserMpf3RL/apcu-5.1.20/libtool --mode=compile cc -I. -I/tmp/pear/temp/apcu -I/tmp/pear/temp/pear-build-defaultuserMpf3RL/apcu-5.1.20/include -I/tmp/pear/temp/pear-build-defaultuserMpf3RL/apcu-5.1.20/main -I/tmp/pear/temp/apcu -I/usr/local/include/php -I/usr/local/include/php/main -I/usr/local/include/php/TSRM -I/usr/local/include/php/Zend -I/usr/local/include/php/ext -I/usr/local/include/php/ext/date/lib  -DHAVE_CONFIG_H  -g -O2   -D_GNU_SOURCE -DZEND_ENABLE_STATIC_TSRMLS_CACHE=1 -c /tmp/pear/temp/apcu/apc_cache.c -o apc_cache.lo
cc -I. -I/tmp/pear/temp/apcu -I/tmp/pear/temp/pear-build-defaultuserMpf3RL/apcu-5.1.20/include -I/tmp/pear/temp/pear-build-defaultuserMpf3RL/apcu-5.1.20/main -I/tmp/pear/temp/apcu -I/usr/local/include/php -I/usr/local/include/php/main -I/usr/local/include/php/TSRM -I/usr/local/include/php/Zend -I/usr/local/include/php/ext -I/usr/local/include/php/ext/date/lib -DHAVE_CONFIG_H -g -O2 -D_GNU_SOURCE -DZEND_ENABLE_STATIC_TSRMLS_CACHE=1 -c /tmp/pear/temp/apcu/apc_cache.c  -fPIC -DPIC -o .libs/apc_cache.o
/bin/bash /tmp/pear/temp/pear-build-defaultuserMpf3RL/apcu-5.1.20/libtool --mode=compile cc -I. -I/tmp/pear/temp/apcu -I/tmp/pear/temp/pear-build-defaultuserMpf3RL/apcu-5.1.20/include -I/tmp/pear/temp/pear-build-defaultuserMpf3RL/apcu-5.1.20/main -I/tmp/pear/temp/apcu -I/usr/local/include/php -I/usr/local/include/php/main -I/usr/local/include/php/TSRM -I/usr/local/include/php/Zend -I/usr/local/include/php/ext -I/usr/local/include/php/ext/date/lib  -DHAVE_CONFIG_H  -g -O2   -D_GNU_SOURCE -DZEND_ENABLE_STATIC_TSRMLS_CACHE=1 -c /tmp/pear/temp/apcu/apc_mmap.c -o apc_mmap.lo
cc -I. -I/tmp/pear/temp/apcu -I/tmp/pear/temp/pear-build-defaultuserMpf3RL/apcu-5.1.20/include -I/tmp/pear/temp/pear-build-defaultuserMpf3RL/apcu-5.1.20/main -I/tmp/pear/temp/apcu -I/usr/local/include/php -I/usr/local/include/php/main -I/usr/local/include/php/TSRM -I/usr/local/include/php/Zend -I/usr/local/include/php/ext -I/usr/local/include/php/ext/date/lib -DHAVE_CONFIG_H -g -O2 -D_GNU_SOURCE -DZEND_ENABLE_STATIC_TSRMLS_CACHE=1 -c /tmp/pear/temp/apcu/apc_mmap.c  -fPIC -DPIC -o .libs/apc_mmap.o
/bin/bash /tmp/pear/temp/pear-build-defaultuserMpf3RL/apcu-5.1.20/libtool --mode=compile cc -I. -I/tmp/pear/temp/apcu -I/tmp/pear/temp/pear-build-defaultuserMpf3RL/apcu-5.1.20/include -I/tmp/pear/temp/pear-build-defaultuserMpf3RL/apcu-5.1.20/main -I/tmp/pear/temp/apcu -I/usr/local/include/php -I/usr/local/include/php/main -I/usr/local/include/php/TSRM -I/usr/local/include/php/Zend -I/usr/local/include/php/ext -I/usr/local/include/php/ext/date/lib  -DHAVE_CONFIG_H  -g -O2   -D_GNU_SOURCE -DZEND_ENABLE_STATIC_TSRMLS_CACHE=1 -c /tmp/pear/temp/apcu/apc_shm.c -o apc_shm.lo
cc -I. -I/tmp/pear/temp/apcu -I/tmp/pear/temp/pear-build-defaultuserMpf3RL/apcu-5.1.20/include -I/tmp/pear/temp/pear-build-defaultuserMpf3RL/apcu-5.1.20/main -I/tmp/pear/temp/apcu -I/usr/local/include/php -I/usr/local/include/php/main -I/usr/local/include/php/TSRM -I/usr/local/include/php/Zend -I/usr/local/include/php/ext -I/usr/local/include/php/ext/date/lib -DHAVE_CONFIG_H -g -O2 -D_GNU_SOURCE -DZEND_ENABLE_STATIC_TSRMLS_CACHE=1 -c /tmp/pear/temp/apcu/apc_shm.c  -fPIC -DPIC -o .libs/apc_shm.o
/bin/bash /tmp/pear/temp/pear-build-defaultuserMpf3RL/apcu-5.1.20/libtool --mode=compile cc -I. -I/tmp/pear/temp/apcu -I/tmp/pear/temp/pear-build-defaultuserMpf3RL/apcu-5.1.20/include -I/tmp/pear/temp/pear-build-defaultuserMpf3RL/apcu-5.1.20/main -I/tmp/pear/temp/apcu -I/usr/local/include/php -I/usr/local/include/php/main -I/usr/local/include/php/TSRM -I/usr/local/include/php/Zend -I/usr/local/include/php/ext -I/usr/local/include/php/ext/date/lib  -DHAVE_CONFIG_H  -g -O2   -D_GNU_SOURCE -DZEND_ENABLE_STATIC_TSRMLS_CACHE=1 -c /tmp/pear/temp/apcu/apc_sma.c -o apc_sma.lo
cc -I. -I/tmp/pear/temp/apcu -I/tmp/pear/temp/pear-build-defaultuserMpf3RL/apcu-5.1.20/include -I/tmp/pear/temp/pear-build-defaultuserMpf3RL/apcu-5.1.20/main -I/tmp/pear/temp/apcu -I/usr/local/include/php -I/usr/local/include/php/main -I/usr/local/include/php/TSRM -I/usr/local/include/php/Zend -I/usr/local/include/php/ext -I/usr/local/include/php/ext/date/lib -DHAVE_CONFIG_H -g -O2 -D_GNU_SOURCE -DZEND_ENABLE_STATIC_TSRMLS_CACHE=1 -c /tmp/pear/temp/apcu/apc_sma.c  -fPIC -DPIC -o .libs/apc_sma.o
/bin/bash /tmp/pear/temp/pear-build-defaultuserMpf3RL/apcu-5.1.20/libtool --mode=compile cc -I. -I/tmp/pear/temp/apcu -I/tmp/pear/temp/pear-build-defaultuserMpf3RL/apcu-5.1.20/include -I/tmp/pear/temp/pear-build-defaultuserMpf3RL/apcu-5.1.20/main -I/tmp/pear/temp/apcu -I/usr/local/include/php -I/usr/local/include/php/main -I/usr/local/include/php/TSRM -I/usr/local/include/php/Zend -I/usr/local/include/php/ext -I/usr/local/include/php/ext/date/lib  -DHAVE_CONFIG_H  -g -O2   -D_GNU_SOURCE -DZEND_ENABLE_STATIC_TSRMLS_CACHE=1 -c /tmp/pear/temp/apcu/apc_stack.c -o apc_stack.lo
cc -I. -I/tmp/pear/temp/apcu -I/tmp/pear/temp/pear-build-defaultuserMpf3RL/apcu-5.1.20/include -I/tmp/pear/temp/pear-build-defaultuserMpf3RL/apcu-5.1.20/main -I/tmp/pear/temp/apcu -I/usr/local/include/php -I/usr/local/include/php/main -I/usr/local/include/php/TSRM -I/usr/local/include/php/Zend -I/usr/local/include/php/ext -I/usr/local/include/php/ext/date/lib -DHAVE_CONFIG_H -g -O2 -D_GNU_SOURCE -DZEND_ENABLE_STATIC_TSRMLS_CACHE=1 -c /tmp/pear/temp/apcu/apc_stack.c  -fPIC -DPIC -o .libs/apc_stack.o
/bin/bash /tmp/pear/temp/pear-build-defaultuserMpf3RL/apcu-5.1.20/libtool --mode=compile cc -I. -I/tmp/pear/temp/apcu -I/tmp/pear/temp/pear-build-defaultuserMpf3RL/apcu-5.1.20/include -I/tmp/pear/temp/pear-build-defaultuserMpf3RL/apcu-5.1.20/main -I/tmp/pear/temp/apcu -I/usr/local/include/php -I/usr/local/include/php/main -I/usr/local/include/php/TSRM -I/usr/local/include/php/Zend -I/usr/local/include/php/ext -I/usr/local/include/php/ext/date/lib  -DHAVE_CONFIG_H  -g -O2   -D_GNU_SOURCE -DZEND_ENABLE_STATIC_TSRMLS_CACHE=1 -c /tmp/pear/temp/apcu/apc_signal.c -o apc_signal.lo
cc -I. -I/tmp/pear/temp/apcu -I/tmp/pear/temp/pear-build-defaultuserMpf3RL/apcu-5.1.20/include -I/tmp/pear/temp/pear-build-defaultuserMpf3RL/apcu-5.1.20/main -I/tmp/pear/temp/apcu -I/usr/local/include/php -I/usr/local/include/php/main -I/usr/local/include/php/TSRM -I/usr/local/include/php/Zend -I/usr/local/include/php/ext -I/usr/local/include/php/ext/date/lib -DHAVE_CONFIG_H -g -O2 -D_GNU_SOURCE -DZEND_ENABLE_STATIC_TSRMLS_CACHE=1 -c /tmp/pear/temp/apcu/apc_signal.c  -fPIC -DPIC -o .libs/apc_signal.o
/bin/bash /tmp/pear/temp/pear-build-defaultuserMpf3RL/apcu-5.1.20/libtool --mode=compile cc -I. -I/tmp/pear/temp/apcu -I/tmp/pear/temp/pear-build-defaultuserMpf3RL/apcu-5.1.20/include -I/tmp/pear/temp/pear-build-defaultuserMpf3RL/apcu-5.1.20/main -I/tmp/pear/temp/apcu -I/usr/local/include/php -I/usr/local/include/php/main -I/usr/local/include/php/TSRM -I/usr/local/include/php/Zend -I/usr/local/include/php/ext -I/usr/local/include/php/ext/date/lib  -DHAVE_CONFIG_H  -g -O2   -D_GNU_SOURCE -DZEND_ENABLE_STATIC_TSRMLS_CACHE=1 -c /tmp/pear/temp/apcu/apc_iterator.c -o apc_iterator.lo
cc -I. -I/tmp/pear/temp/apcu -I/tmp/pear/temp/pear-build-defaultuserMpf3RL/apcu-5.1.20/include -I/tmp/pear/temp/pear-build-defaultuserMpf3RL/apcu-5.1.20/main -I/tmp/pear/temp/apcu -I/usr/local/include/php -I/usr/local/include/php/main -I/usr/local/include/php/TSRM -I/usr/local/include/php/Zend -I/usr/local/include/php/ext -I/usr/local/include/php/ext/date/lib -DHAVE_CONFIG_H -g -O2 -D_GNU_SOURCE -DZEND_ENABLE_STATIC_TSRMLS_CACHE=1 -c /tmp/pear/temp/apcu/apc_iterator.c  -fPIC -DPIC -o .libs/apc_iterator.o
/bin/bash /tmp/pear/temp/pear-build-defaultuserMpf3RL/apcu-5.1.20/libtool --mode=compile cc -I. -I/tmp/pear/temp/apcu -I/tmp/pear/temp/pear-build-defaultuserMpf3RL/apcu-5.1.20/include -I/tmp/pear/temp/pear-build-defaultuserMpf3RL/apcu-5.1.20/main -I/tmp/pear/temp/apcu -I/usr/local/include/php -I/usr/local/include/php/main -I/usr/local/include/php/TSRM -I/usr/local/include/php/Zend -I/usr/local/include/php/ext -I/usr/local/include/php/ext/date/lib  -DHAVE_CONFIG_H  -g -O2   -D_GNU_SOURCE -DZEND_ENABLE_STATIC_TSRMLS_CACHE=1 -c /tmp/pear/temp/apcu/apc_persist.c -o apc_persist.lo
cc -I. -I/tmp/pear/temp/apcu -I/tmp/pear/temp/pear-build-defaultuserMpf3RL/apcu-5.1.20/include -I/tmp/pear/temp/pear-build-defaultuserMpf3RL/apcu-5.1.20/main -I/tmp/pear/temp/apcu -I/usr/local/include/php -I/usr/local/include/php/main -I/usr/local/include/php/TSRM -I/usr/local/include/php/Zend -I/usr/local/include/php/ext -I/usr/local/include/php/ext/date/lib -DHAVE_CONFIG_H -g -O2 -D_GNU_SOURCE -DZEND_ENABLE_STATIC_TSRMLS_CACHE=1 -c /tmp/pear/temp/apcu/apc_persist.c  -fPIC -DPIC -o .libs/apc_persist.o
/bin/bash /tmp/pear/temp/pear-build-defaultuserMpf3RL/apcu-5.1.20/libtool --mode=link cc -shared -I/tmp/pear/temp/pear-build-defaultuserMpf3RL/apcu-5.1.20/include -I/tmp/pear/temp/pear-build-defaultuserMpf3RL/apcu-5.1.20/main -I/tmp/pear/temp/apcu -I/usr/local/include/php -I/usr/local/include/php/main -I/usr/local/include/php/TSRM -I/usr/local/include/php/Zend -I/usr/local/include/php/ext -I/usr/local/include/php/ext/date/lib  -DHAVE_CONFIG_H  -g -O2    -o apcu.la -export-dynamic -avoid-version -prefer-pic -module -rpath /tmp/pear/temp/pear-build-defaultuserMpf3RL/apcu-5.1.20/modules  apc.lo apc_lock.lo apc_mutex.lo php_apc.lo apc_cache.lo apc_mmap.lo apc_shm.lo apc_sma.lo apc_stack.lo apc_signal.lo apc_iterator.lo apc_persist.lo -lrt
cc -shared  .libs/apc.o .libs/apc_lock.o .libs/apc_mutex.o .libs/php_apc.o .libs/apc_cache.o .libs/apc_mmap.o .libs/apc_shm.o .libs/apc_sma.o .libs/apc_stack.o .libs/apc_signal.o .libs/apc_iterator.o .libs/apc_persist.o  -lrt  -Wl,-soname -Wl,apcu.so -o .libs/apcu.so
creating apcu.la
(cd .libs && rm -f apcu.la && ln -s ../apcu.la apcu.la)
/bin/bash /tmp/pear/temp/pear-build-defaultuserMpf3RL/apcu-5.1.20/libtool --mode=install cp ./apcu.la /tmp/pear/temp/pear-build-defaultuserMpf3RL/apcu-5.1.20/modules
cp ./.libs/apcu.so /tmp/pear/temp/pear-build-defaultuserMpf3RL/apcu-5.1.20/modules/apcu.so
cp ./.libs/apcu.lai /tmp/pear/temp/pear-build-defaultuserMpf3RL/apcu-5.1.20/modules/apcu.la
PATH="$PATH:/sbin" ldconfig -n /tmp/pear/temp/pear-build-defaultuserMpf3RL/apcu-5.1.20/modules
----------------------------------------------------------------------
Libraries have been installed in:
/tmp/pear/temp/pear-build-defaultuserMpf3RL/apcu-5.1.20/modules
If you ever happen to want to link against installed libraries
in a given directory, LIBDIR, you must either use libtool, and
specify the full pathname of the library, or use the `-LLIBDIR'
flag during linking and do at least one of the following:
- add LIBDIR to the `LD_LIBRARY_PATH' environment variable
during execution
- add LIBDIR to the `LD_RUN_PATH' environment variable
during linking
- use the `-Wl,--rpath -Wl,LIBDIR' linker flag
- have your system administrator add LIBDIR to `/etc/ld.so.conf'
See any operating system documentation about shared libraries for
more information, such as the ld(1) and ld.so(8) manual pages.
----------------------------------------------------------------------
Build complete.
Don't forget to run 'make test'.
running: make INSTALL_ROOT="/tmp/pear/temp/pear-build-defaultuserMpf3RL/install-apcu-5.1.20" install
Installing shared extensions:     /tmp/pear/temp/pear-build-defaultuserMpf3RL/install-apcu-5.1.20/usr/local/lib/php/extensions/no-debug-non-zts-20200930/
Installing header files:          /tmp/pear/temp/pear-build-defaultuserMpf3RL/install-apcu-5.1.20/usr/local/include/php/
running: find "/tmp/pear/temp/pear-build-defaultuserMpf3RL/install-apcu-5.1.20" | xargs ls -dils
1280389   4 drwxr-xr-x 3 root root   4096 Apr 30 00:40 /tmp/pear/temp/pear-build-defaultuserMpf3RL/install-apcu-5.1.20
1280432   4 drwxr-xr-x 3 root root   4096 Apr 30 00:40 /tmp/pear/temp/pear-build-defaultuserMpf3RL/install-apcu-5.1.20/usr
1280433   4 drwxr-xr-x 4 root root   4096 Apr 30 00:40 /tmp/pear/temp/pear-build-defaultuserMpf3RL/install-apcu-5.1.20/usr/local
1280438   4 drwxr-xr-x 3 root root   4096 Apr 30 00:40 /tmp/pear/temp/pear-build-defaultuserMpf3RL/install-apcu-5.1.20/usr/local/include
1280439   4 drwxr-xr-x 3 root root   4096 Apr 30 00:40 /tmp/pear/temp/pear-build-defaultuserMpf3RL/install-apcu-5.1.20/usr/local/include/php
1280440   4 drwxr-xr-x 3 root root   4096 Apr 30 00:40 /tmp/pear/temp/pear-build-defaultuserMpf3RL/install-apcu-5.1.20/usr/local/include/php/ext
1280441   4 drwxr-xr-x 2 root root   4096 Apr 30 00:40 /tmp/pear/temp/pear-build-defaultuserMpf3RL/install-apcu-5.1.20/usr/local/include/php/ext/apcu
1280443   8 -rw-r--r-- 1 root root   6232 Apr 30 00:40 /tmp/pear/temp/pear-build-defaultuserMpf3RL/install-apcu-5.1.20/usr/local/include/php/ext/apcu/apc.h
1280444   4 -rw-r--r-- 1 root root   1261 Apr 30 00:40 /tmp/pear/temp/pear-build-defaultuserMpf3RL/install-apcu-5.1.20/usr/local/include/php/ext/apcu/apc_api.h
1280453   4 -rw-r--r-- 1 root root    113 Apr 30 00:40 /tmp/pear/temp/pear-build-defaultuserMpf3RL/install-apcu-5.1.20/usr/local/include/php/ext/apcu/apc_arginfo.h
1280445  16 -rw-r--r-- 1 root root  13338 Apr 30 00:40 /tmp/pear/temp/pear-build-defaultuserMpf3RL/install-apcu-5.1.20/usr/local/include/php/ext/apcu/apc_cache.h
1280446   4 -rw-r--r-- 1 root root   3636 Apr 30 00:40 /tmp/pear/temp/pear-build-defaultuserMpf3RL/install-apcu-5.1.20/usr/local/include/php/ext/apcu/apc_globals.h
1280447   4 -rw-r--r-- 1 root root   3884 Apr 30 00:40 /tmp/pear/temp/pear-build-defaultuserMpf3RL/install-apcu-5.1.20/usr/local/include/php/ext/apcu/apc_iterator.h
1280448   8 -rw-r--r-- 1 root root   4425 Apr 30 00:40 /tmp/pear/temp/pear-build-defaultuserMpf3RL/install-apcu-5.1.20/usr/local/include/php/ext/apcu/apc_lock.h
1280449   4 -rw-r--r-- 1 root root   2303 Apr 30 00:40 /tmp/pear/temp/pear-build-defaultuserMpf3RL/install-apcu-5.1.20/usr/local/include/php/ext/apcu/apc_mutex.h
1280451   4 -rw-r--r-- 1 root root   3033 Apr 30 00:40 /tmp/pear/temp/pear-build-defaultuserMpf3RL/install-apcu-5.1.20/usr/local/include/php/ext/apcu/apc_serializer.h
1280450   8 -rw-r--r-- 1 root root   5611 Apr 30 00:40 /tmp/pear/temp/pear-build-defaultuserMpf3RL/install-apcu-5.1.20/usr/local/include/php/ext/apcu/apc_sma.h
1280452   4 -rw-r--r-- 1 root root   2277 Apr 30 00:40 /tmp/pear/temp/pear-build-defaultuserMpf3RL/install-apcu-5.1.20/usr/local/include/php/ext/apcu/apc_stack.h
1280442   4 -rw-r--r-- 1 root root   2283 Apr 30 00:40 /tmp/pear/temp/pear-build-defaultuserMpf3RL/install-apcu-5.1.20/usr/local/include/php/ext/apcu/php_apc.h
1280454   4 -rw-r--r-- 1 root root   2981 Apr 30 00:40 /tmp/pear/temp/pear-build-defaultuserMpf3RL/install-apcu-5.1.20/usr/local/include/php/ext/apcu/php_apc_legacy_arginfo.h
1280434   4 drwxr-xr-x 3 root root   4096 Apr 30 00:40 /tmp/pear/temp/pear-build-defaultuserMpf3RL/install-apcu-5.1.20/usr/local/lib
1280435   4 drwxr-xr-x 3 root root   4096 Apr 30 00:40 /tmp/pear/temp/pear-build-defaultuserMpf3RL/install-apcu-5.1.20/usr/local/lib/php
1280436   4 drwxr-xr-x 3 root root   4096 Apr 30 00:40 /tmp/pear/temp/pear-build-defaultuserMpf3RL/install-apcu-5.1.20/usr/local/lib/php/extensions
1280437   4 drwxr-xr-x 2 root root   4096 Apr 30 00:40 /tmp/pear/temp/pear-build-defaultuserMpf3RL/install-apcu-5.1.20/usr/local/lib/php/extensions/no-debug-non-zts-20200930
1280430 660 -rwxr-xr-x 1 root root 672176 Apr 30 00:40 /tmp/pear/temp/pear-build-defaultuserMpf3RL/install-apcu-5.1.20/usr/local/lib/php/extensions/no-debug-non-zts-20200930/apcu.so
Build process completed successfully
Installing '/usr/local/lib/php/extensions/no-debug-non-zts-20200930/apcu.so'
Installing '/usr/local/include/php/ext/apcu/apc_api.h'
Installing '/usr/local/include/php/ext/apcu/apc.h'
Installing '/usr/local/include/php/ext/apcu/apc_arginfo.h'
Installing '/usr/local/include/php/ext/apcu/apc_cache.h'
Installing '/usr/local/include/php/ext/apcu/apc_lock.h'
Installing '/usr/local/include/php/ext/apcu/apc_sma.h'
Installing '/usr/local/include/php/ext/apcu/apc_serializer.h'
Installing '/usr/local/include/php/ext/apcu/apc_globals.h'
Installing '/usr/local/include/php/ext/apcu/apc_stack.h'
Installing '/usr/local/include/php/ext/apcu/apc_iterator.h'
Installing '/usr/local/include/php/ext/apcu/php_apc.h'
Installing '/usr/local/include/php/ext/apcu/apc_mutex.h'
Installing '/usr/local/include/php/ext/apcu/php_apc_legacy_arginfo.h'
install ok: channel://pecl.php.net/apcu-5.1.20
4 source files, building
running: phpize
Configuring for:
PHP Api Version:         20200930
Zend Module Api No:      20200930
Zend Extension Api No:   420200930
building in /tmp/pear/temp/pear-build-defaultuserNwYb7S/apcu_bc-1.0.5
running: /tmp/pear/temp/apcu_bc/configure --with-php-config=/usr/local/bin/php-config
checking for grep that handles long lines and -e... /bin/grep
checking for egrep... /bin/grep -E
checking for a sed that does not truncate output... /bin/sed
checking for pkg-config... /usr/bin/pkg-config
checking pkg-config is at least version 0.9.0... yes
checking for cc... cc
checking whether the C compiler works... yes
checking for C compiler default output file name... a.out
checking for suffix of executables...
checking whether we are cross compiling... no
checking for suffix of object files... o
checking whether we are using the GNU C compiler... yes
checking whether cc accepts -g... yes
checking for cc option to accept ISO C89... none needed
checking how to run the C preprocessor... cc -E
checking for icc... no
checking for suncc... no
checking for system library directory... lib
checking if compiler supports -R... no
checking if compiler supports -Wl,-rpath,... yes
checking build system type... x86_64-pc-linux-gnu
checking host system type... x86_64-pc-linux-gnu
checking target system type... x86_64-pc-linux-gnu
checking for PHP prefix... /usr/local
checking for PHP includes... -I/usr/local/include/php -I/usr/local/include/php/main -I/usr/local/include/php/TSRM -I/usr/local/include/php/Zend -I/usr/local/include/php/ext -I/usr/local/include/php/ext/date/lib
checking for PHP extension directory... /usr/local/lib/php/extensions/no-debug-non-zts-20200930
checking for PHP installed headers prefix... /usr/local/include/php
checking if debug is enabled... no
checking if zts is enabled... no
checking for gawk... no
checking for nawk... nawk
checking if nawk is broken... no
checking whether to enable APCu BC support... yes, shared
checking for a sed that does not truncate output... /bin/sed
checking for ld used by cc... /usr/bin/ld
checking if the linker (/usr/bin/ld) is GNU ld... yes
checking for /usr/bin/ld option to reload object files... -r
checking for BSD-compatible nm... /usr/bin/nm -B
checking whether ln -s works... yes
checking how to recognize dependent libraries... pass_all
checking for ANSI C header files... yes
checking for sys/types.h... yes
checking for sys/stat.h... yes
checking for stdlib.h... yes
checking for string.h... yes
checking for memory.h... yes
checking for strings.h... yes
checking for inttypes.h... yes
checking for stdint.h... yes
checking for unistd.h... yes
checking dlfcn.h usability... yes
checking dlfcn.h presence... yes
checking for dlfcn.h... yes
checking the maximum length of command line arguments... 1572864
checking command to parse /usr/bin/nm -B output from cc object... ok
checking for objdir... .libs
checking for ar... ar
checking for ranlib... ranlib
checking for strip... strip
checking if cc supports -fno-rtti -fno-exceptions... no
checking for cc option to produce PIC... -fPIC
checking if cc PIC flag -fPIC works... yes
checking if cc static flag -static works... yes
checking if cc supports -c -o file.o... yes
checking whether the cc linker (/usr/bin/ld -m elf_x86_64) supports shared libraries... yes
checking whether -lc should be explicitly linked in... no
checking dynamic linker characteristics... GNU/Linux ld.so
checking how to hardcode library paths into programs... immediate
checking whether stripping libraries is possible... yes
checking if libtool supports shared libraries... yes
checking whether to build shared libraries... yes
checking whether to build static libraries... no
creating libtool
appending configuration tag "CXX" to libtool
configure: patching config.h.in
configure: creating ./config.status
config.status: creating config.h
running: make
/bin/bash /tmp/pear/temp/pear-build-defaultuserNwYb7S/apcu_bc-1.0.5/libtool --mode=compile cc -I. -I/tmp/pear/temp/apcu_bc -I/tmp/pear/temp/pear-build-defaultuserNwYb7S/apcu_bc-1.0.5/include -I/tmp/pear/temp/pear-build-defaultuserNwYb7S/apcu_bc-1.0.5/main -I/tmp/pear/temp/apcu_bc -I/usr/local/include/php -I/usr/local/include/php/main -I/usr/local/include/php/TSRM -I/usr/local/include/php/Zend -I/usr/local/include/php/ext -I/usr/local/include/php/ext/date/lib  -DHAVE_CONFIG_H  -g -O2   -DZEND_ENABLE_STATIC_TSRMLS_CACHE=1 -c /tmp/pear/temp/apcu_bc/php_apc.c -o php_apc.lo
mkdir .libs
cc -I. -I/tmp/pear/temp/apcu_bc -I/tmp/pear/temp/pear-build-defaultuserNwYb7S/apcu_bc-1.0.5/include -I/tmp/pear/temp/pear-build-defaultuserNwYb7S/apcu_bc-1.0.5/main -I/tmp/pear/temp/apcu_bc -I/usr/local/include/php -I/usr/local/include/php/main -I/usr/local/include/php/TSRM -I/usr/local/include/php/Zend -I/usr/local/include/php/ext -I/usr/local/include/php/ext/date/lib -DHAVE_CONFIG_H -g -O2 -DZEND_ENABLE_STATIC_TSRMLS_CACHE=1 -c /tmp/pear/temp/apcu_bc/php_apc.c  -fPIC -DPIC -o .libs/php_apc.o
In file included from /tmp/pear/temp/apcu_bc/php_apc.c:35:
/usr/local/include/php/ext/apcu/apc_arginfo.h:4:3: error: #error Not supported on PHP >= 8.0
# error Not supported on PHP >= 8.0
^~~~~
In file included from /usr/local/include/php/main/php.h:35,
from /tmp/pear/temp/apcu_bc/php_apc.c:23:
/usr/local/include/php/Zend/zend_API.h:85:69: error: 'zif_apcu_store' undeclared here (not in a function); did you mean 'zif_apc_dec'?
#define ZEND_FALIAS(name, alias, arg_info)   ZEND_RAW_FENTRY(#name, zif_##alias, arg_info, 0)
^~~~
/usr/local/include/php/Zend/zend_API.h:77:74: note: in definition of macro 'ZEND_RAW_FENTRY'
#define ZEND_RAW_FENTRY(zend_name, name, arg_info, flags)   { zend_name, name, arg_info, (uint32_t) (sizeof(arg_info)/sizeof(struct _zend_internal_arg_info)-1), flags },
^~~~
/usr/local/include/php/main/php.h:386:21: note: in expansion of macro 'ZEND_FALIAS'
#define PHP_FALIAS  ZEND_FALIAS
^~~~~~~~~~~
/tmp/pear/temp/apcu_bc/php_apc.c:173:2: note: in expansion of macro 'PHP_FALIAS'
PHP_FALIAS(apc_store,    apcu_store,    arginfo_apcu_store)
^~~~~~~~~~
/tmp/pear/temp/apcu_bc/php_apc.c:173:42: error: 'arginfo_apcu_store' undeclared here (not in a function)
PHP_FALIAS(apc_store,    apcu_store,    arginfo_apcu_store)
^~~~~~~~~~~~~~~~~~
/usr/local/include/php/Zend/zend_API.h:77:80: note: in definition of macro 'ZEND_RAW_FENTRY'
#define ZEND_RAW_FENTRY(zend_name, name, arg_info, flags)   { zend_name, name, arg_info, (uint32_t) (sizeof(arg_info)/sizeof(struct _zend_internal_arg_info)-1), flags },
^~~~~~~~
/usr/local/include/php/main/php.h:386:21: note: in expansion of macro 'ZEND_FALIAS'
#define PHP_FALIAS  ZEND_FALIAS
^~~~~~~~~~~
/tmp/pear/temp/apcu_bc/php_apc.c:173:2: note: in expansion of macro 'PHP_FALIAS'
PHP_FALIAS(apc_store,    apcu_store,    arginfo_apcu_store)
^~~~~~~~~~
/usr/local/include/php/Zend/zend_API.h:85:69: error: 'zif_apcu_fetch' undeclared here (not in a function); did you mean 'zif_apc_dec'?
#define ZEND_FALIAS(name, alias, arg_info)   ZEND_RAW_FENTRY(#name, zif_##alias, arg_info, 0)
^~~~
/usr/local/include/php/Zend/zend_API.h:77:74: note: in definition of macro 'ZEND_RAW_FENTRY'
#define ZEND_RAW_FENTRY(zend_name, name, arg_info, flags)   { zend_name, name, arg_info, (uint32_t) (sizeof(arg_info)/sizeof(struct _zend_internal_arg_info)-1), flags },
^~~~
/usr/local/include/php/main/php.h:386:21: note: in expansion of macro 'ZEND_FALIAS'
#define PHP_FALIAS  ZEND_FALIAS
^~~~~~~~~~~
/tmp/pear/temp/apcu_bc/php_apc.c:174:2: note: in expansion of macro 'PHP_FALIAS'
PHP_FALIAS(apc_fetch,    apcu_fetch,    arginfo_apcu_fetch)
^~~~~~~~~~
/tmp/pear/temp/apcu_bc/php_apc.c:174:42: error: 'arginfo_apcu_fetch' undeclared here (not in a function); did you mean 'zif_apc_dec'?
PHP_FALIAS(apc_fetch,    apcu_fetch,    arginfo_apcu_fetch)
^~~~~~~~~~~~~~~~~~
/usr/local/include/php/Zend/zend_API.h:77:80: note: in definition of macro 'ZEND_RAW_FENTRY'
#define ZEND_RAW_FENTRY(zend_name, name, arg_info, flags)   { zend_name, name, arg_info, (uint32_t) (sizeof(arg_info)/sizeof(struct _zend_internal_arg_info)-1), flags },
^~~~~~~~
/usr/local/include/php/main/php.h:386:21: note: in expansion of macro 'ZEND_FALIAS'
#define PHP_FALIAS  ZEND_FALIAS
^~~~~~~~~~~
/tmp/pear/temp/apcu_bc/php_apc.c:174:2: note: in expansion of macro 'PHP_FALIAS'
PHP_FALIAS(apc_fetch,    apcu_fetch,    arginfo_apcu_fetch)
^~~~~~~~~~
/usr/local/include/php/Zend/zend_API.h:85:69: error: 'zif_apcu_enabled' undeclared here (not in a function); did you mean 'zif_apc_dec'?
#define ZEND_FALIAS(name, alias, arg_info)   ZEND_RAW_FENTRY(#name, zif_##alias, arg_info, 0)
^~~~
/usr/local/include/php/Zend/zend_API.h:77:74: note: in definition of macro 'ZEND_RAW_FENTRY'
#define ZEND_RAW_FENTRY(zend_name, name, arg_info, flags)   { zend_name, name, arg_info, (uint32_t) (sizeof(arg_info)/sizeof(struct _zend_internal_arg_info)-1), flags },
^~~~
/usr/local/include/php/main/php.h:386:21: note: in expansion of macro 'ZEND_FALIAS'
#define PHP_FALIAS  ZEND_FALIAS
^~~~~~~~~~~
/tmp/pear/temp/apcu_bc/php_apc.c:175:2: note: in expansion of macro 'PHP_FALIAS'
PHP_FALIAS(apc_enabled,  apcu_enabled,  arginfo_apcu_enabled)
^~~~~~~~~~
/tmp/pear/temp/apcu_bc/php_apc.c:175:42: error: 'arginfo_apcu_enabled' undeclared here (not in a function); did you mean 'apc_is_enabled'?
PHP_FALIAS(apc_enabled,  apcu_enabled,  arginfo_apcu_enabled)
^~~~~~~~~~~~~~~~~~~~
/usr/local/include/php/Zend/zend_API.h:77:80: note: in definition of macro 'ZEND_RAW_FENTRY'
#define ZEND_RAW_FENTRY(zend_name, name, arg_info, flags)   { zend_name, name, arg_info, (uint32_t) (sizeof(arg_info)/sizeof(struct _zend_internal_arg_info)-1), flags },
^~~~~~~~
/usr/local/include/php/main/php.h:386:21: note: in expansion of macro 'ZEND_FALIAS'
#define PHP_FALIAS  ZEND_FALIAS
^~~~~~~~~~~
/tmp/pear/temp/apcu_bc/php_apc.c:175:2: note: in expansion of macro 'PHP_FALIAS'
PHP_FALIAS(apc_enabled,  apcu_enabled,  arginfo_apcu_enabled)
^~~~~~~~~~
/usr/local/include/php/Zend/zend_API.h:85:69: error: 'zif_apcu_delete' undeclared here (not in a function); did you mean 'zif_apc_dec'?
#define ZEND_FALIAS(name, alias, arg_info)   ZEND_RAW_FENTRY(#name, zif_##alias, arg_info, 0)
^~~~
/usr/local/include/php/Zend/zend_API.h:77:74: note: in definition of macro 'ZEND_RAW_FENTRY'
#define ZEND_RAW_FENTRY(zend_name, name, arg_info, flags)   { zend_name, name, arg_info, (uint32_t) (sizeof(arg_info)/sizeof(struct _zend_internal_arg_info)-1), flags },
^~~~
/usr/local/include/php/main/php.h:386:21: note: in expansion of macro 'ZEND_FALIAS'
#define PHP_FALIAS  ZEND_FALIAS
^~~~~~~~~~~
/tmp/pear/temp/apcu_bc/php_apc.c:176:2: note: in expansion of macro 'PHP_FALIAS'
PHP_FALIAS(apc_delete,   apcu_delete,   arginfo_apcu_delete)
^~~~~~~~~~
/tmp/pear/temp/apcu_bc/php_apc.c:176:42: error: 'arginfo_apcu_delete' undeclared here (not in a function)
PHP_FALIAS(apc_delete,   apcu_delete,   arginfo_apcu_delete)
^~~~~~~~~~~~~~~~~~~
/usr/local/include/php/Zend/zend_API.h:77:80: note: in definition of macro 'ZEND_RAW_FENTRY'
#define ZEND_RAW_FENTRY(zend_name, name, arg_info, flags)   { zend_name, name, arg_info, (uint32_t) (sizeof(arg_info)/sizeof(struct _zend_internal_arg_info)-1), flags },
^~~~~~~~
/usr/local/include/php/main/php.h:386:21: note: in expansion of macro 'ZEND_FALIAS'
#define PHP_FALIAS  ZEND_FALIAS
^~~~~~~~~~~
/tmp/pear/temp/apcu_bc/php_apc.c:176:2: note: in expansion of macro 'PHP_FALIAS'
PHP_FALIAS(apc_delete,   apcu_delete,   arginfo_apcu_delete)
^~~~~~~~~~
/usr/local/include/php/Zend/zend_API.h:85:69: error: 'zif_apcu_add' undeclared here (not in a function); did you mean 'zif_apc_dec'?
#define ZEND_FALIAS(name, alias, arg_info)   ZEND_RAW_FENTRY(#name, zif_##alias, arg_info, 0)
^~~~
/usr/local/include/php/Zend/zend_API.h:77:74: note: in definition of macro 'ZEND_RAW_FENTRY'
#define ZEND_RAW_FENTRY(zend_name, name, arg_info, flags)   { zend_name, name, arg_info, (uint32_t) (sizeof(arg_info)/sizeof(struct _zend_internal_arg_info)-1), flags },
^~~~
/usr/local/include/php/main/php.h:386:21: note: in expansion of macro 'ZEND_FALIAS'
#define PHP_FALIAS  ZEND_FALIAS
^~~~~~~~~~~
/tmp/pear/temp/apcu_bc/php_apc.c:177:2: note: in expansion of macro 'PHP_FALIAS'
PHP_FALIAS(apc_add,      apcu_add,      arginfo_apcu_store)
^~~~~~~~~~
/usr/local/include/php/Zend/zend_API.h:85:69: error: 'zif_apcu_sma_info' undeclared here (not in a function); did you mean 'zif_apc_cache_info'?
#define ZEND_FALIAS(name, alias, arg_info)   ZEND_RAW_FENTRY(#name, zif_##alias, arg_info, 0)
^~~~
/usr/local/include/php/Zend/zend_API.h:77:74: note: in definition of macro 'ZEND_RAW_FENTRY'
#define ZEND_RAW_FENTRY(zend_name, name, arg_info, flags)   { zend_name, name, arg_info, (uint32_t) (sizeof(arg_info)/sizeof(struct _zend_internal_arg_info)-1), flags },
^~~~
/usr/local/include/php/main/php.h:386:21: note: in expansion of macro 'ZEND_FALIAS'
#define PHP_FALIAS  ZEND_FALIAS
^~~~~~~~~~~
/tmp/pear/temp/apcu_bc/php_apc.c:178:2: note: in expansion of macro 'PHP_FALIAS'
PHP_FALIAS(apc_sma_info, apcu_sma_info, arginfo_apcu_sma_info)
^~~~~~~~~~
/tmp/pear/temp/apcu_bc/php_apc.c:178:42: error: 'arginfo_apcu_sma_info' undeclared here (not in a function); did you mean 'arginfo_apcu_bc_cache_info'?
PHP_FALIAS(apc_sma_info, apcu_sma_info, arginfo_apcu_sma_info)
^~~~~~~~~~~~~~~~~~~~~
/usr/local/include/php/Zend/zend_API.h:77:80: note: in definition of macro 'ZEND_RAW_FENTRY'
#define ZEND_RAW_FENTRY(zend_name, name, arg_info, flags)   { zend_name, name, arg_info, (uint32_t) (sizeof(arg_info)/sizeof(struct _zend_internal_arg_info)-1), flags },
^~~~~~~~
/usr/local/include/php/main/php.h:386:21: note: in expansion of macro 'ZEND_FALIAS'
#define PHP_FALIAS  ZEND_FALIAS
^~~~~~~~~~~
/tmp/pear/temp/apcu_bc/php_apc.c:178:2: note: in expansion of macro 'PHP_FALIAS'
PHP_FALIAS(apc_sma_info, apcu_sma_info, arginfo_apcu_sma_info)
^~~~~~~~~~
/tmp/pear/temp/apcu_bc/php_apc.c:179:42: error: 'arginfo_apcu_inc' undeclared here (not in a function); did you mean 'zif_apc_inc'?
PHP_FE(apc_inc,                         arginfo_apcu_inc)
^~~~~~~~~~~~~~~~
/usr/local/include/php/Zend/zend_API.h:77:80: note: in definition of macro 'ZEND_RAW_FENTRY'
#define ZEND_RAW_FENTRY(zend_name, name, arg_info, flags)   { zend_name, name, arg_info, (uint32_t) (sizeof(arg_info)/sizeof(struct _zend_internal_arg_info)-1), flags },
^~~~~~~~
/usr/local/include/php/main/php.h:384:18: note: in expansion of macro 'ZEND_FE'
#define PHP_FE   ZEND_FE
^~~~~~~
/tmp/pear/temp/apcu_bc/php_apc.c:179:2: note: in expansion of macro 'PHP_FE'
PHP_FE(apc_inc,                         arginfo_apcu_inc)
^~~~~~
/usr/local/include/php/Zend/zend_API.h:85:69: error: 'zif_apcu_cas' undeclared here (not in a function); did you mean 'zif_apc_dec'?
#define ZEND_FALIAS(name, alias, arg_info)   ZEND_RAW_FENTRY(#name, zif_##alias, arg_info, 0)
^~~~
/usr/local/include/php/Zend/zend_API.h:77:74: note: in definition of macro 'ZEND_RAW_FENTRY'
#define ZEND_RAW_FENTRY(zend_name, name, arg_info, flags)   { zend_name, name, arg_info, (uint32_t) (sizeof(arg_info)/sizeof(struct _zend_internal_arg_info)-1), flags },
^~~~
/usr/local/include/php/main/php.h:386:21: note: in expansion of macro 'ZEND_FALIAS'
#define PHP_FALIAS  ZEND_FALIAS
^~~~~~~~~~~
/tmp/pear/temp/apcu_bc/php_apc.c:181:2: note: in expansion of macro 'PHP_FALIAS'
PHP_FALIAS(apc_cas,      apcu_cas,      arginfo_apcu_cas)
^~~~~~~~~~
/tmp/pear/temp/apcu_bc/php_apc.c:181:42: error: 'arginfo_apcu_cas' undeclared here (not in a function); did you mean 'zm_info_apc'?
PHP_FALIAS(apc_cas,      apcu_cas,      arginfo_apcu_cas)
^~~~~~~~~~~~~~~~
/usr/local/include/php/Zend/zend_API.h:77:80: note: in definition of macro 'ZEND_RAW_FENTRY'
#define ZEND_RAW_FENTRY(zend_name, name, arg_info, flags)   { zend_name, name, arg_info, (uint32_t) (sizeof(arg_info)/sizeof(struct _zend_internal_arg_info)-1), flags },
^~~~~~~~
/usr/local/include/php/main/php.h:386:21: note: in expansion of macro 'ZEND_FALIAS'
#define PHP_FALIAS  ZEND_FALIAS
^~~~~~~~~~~
/tmp/pear/temp/apcu_bc/php_apc.c:181:2: note: in expansion of macro 'PHP_FALIAS'
PHP_FALIAS(apc_cas,      apcu_cas,      arginfo_apcu_cas)
^~~~~~~~~~
/usr/local/include/php/Zend/zend_API.h:85:69: error: 'zif_apcu_exists' undeclared here (not in a function); did you mean 'zif_apc_inc'?
#define ZEND_FALIAS(name, alias, arg_info)   ZEND_RAW_FENTRY(#name, zif_##alias, arg_info, 0)
^~~~
/usr/local/include/php/Zend/zend_API.h:77:74: note: in definition of macro 'ZEND_RAW_FENTRY'
#define ZEND_RAW_FENTRY(zend_name, name, arg_info, flags)   { zend_name, name, arg_info, (uint32_t) (sizeof(arg_info)/sizeof(struct _zend_internal_arg_info)-1), flags },
^~~~
/usr/local/include/php/main/php.h:386:21: note: in expansion of macro 'ZEND_FALIAS'
#define PHP_FALIAS  ZEND_FALIAS
^~~~~~~~~~~
/tmp/pear/temp/apcu_bc/php_apc.c:182:2: note: in expansion of macro 'PHP_FALIAS'
PHP_FALIAS(apc_exists,   apcu_exists,   arginfo_apcu_exists)
^~~~~~~~~~
/tmp/pear/temp/apcu_bc/php_apc.c:182:42: error: 'arginfo_apcu_exists' undeclared here (not in a function)
PHP_FALIAS(apc_exists,   apcu_exists,   arginfo_apcu_exists)
^~~~~~~~~~~~~~~~~~~
/usr/local/include/php/Zend/zend_API.h:77:80: note: in definition of macro 'ZEND_RAW_FENTRY'
#define ZEND_RAW_FENTRY(zend_name, name, arg_info, flags)   { zend_name, name, arg_info, (uint32_t) (sizeof(arg_info)/sizeof(struct _zend_internal_arg_info)-1), flags },
^~~~~~~~
/usr/local/include/php/main/php.h:386:21: note: in expansion of macro 'ZEND_FALIAS'
#define PHP_FALIAS  ZEND_FALIAS
^~~~~~~~~~~
/tmp/pear/temp/apcu_bc/php_apc.c:182:2: note: in expansion of macro 'PHP_FALIAS'
PHP_FALIAS(apc_exists,   apcu_exists,   arginfo_apcu_exists)
^~~~~~~~~~
make: *** [Makefile:208: php_apc.lo] Error 1
ERROR: `make' failed