php-ext.com / bbcode (from dev using PHP 8.0.5-buster)

Dockerfile
FROM php:8.0.5-buster
WORKDIR /tmp
RUN apt update && \
    apt install -y --no-install-recommends git subversion autoconf build-essential && \
    rm -rf /var/lib/apt/lists/*
RUN svn checkout --revision HEAD https://svn.php.net/repository/pecl/bbcode /tmp/ext-src && \
    cd /tmp/ext-src/trunk && \
    phpize && \
    ./configure --enable-bbcode && \
    make && \
    make test
Build output FAIL 11ss
Step 1/4 : FROM php:8.0.5-buster
---> 9d3d64fb1730
Step 2/4 : WORKDIR /tmp
---> Running in 9be8b225f152
Removing intermediate container 9be8b225f152
---> 18bf063ec47e
Step 3/4 : RUN apt update && apt install -y --no-install-recommends git subversion autoconf build-essential && rm -rf /var/lib/apt/lists/*
---> Running in 158fe685240c

WARNING: apt does not have a stable CLI interface. Use with caution in scripts.


Get:1 http://security.debian.org/debian-security buster/updates InRelease [65.4 kB]
Get:2 http://deb.debian.org/debian buster InRelease [121 kB]
Get:3 http://deb.debian.org/debian buster-updates InRelease [51.9 kB]
Get:4 http://security.debian.org/debian-security buster/updates/main amd64 Packages [285 kB]
Get:5 http://deb.debian.org/debian buster/main amd64 Packages [7907 kB]
Get:6 http://deb.debian.org/debian buster-updates/main amd64 Packages [10.9 kB]
Fetched 8441 kB in 1s (5741 kB/s)
Reading package lists...
Building dependency tree...
Reading state information...
2 packages can be upgraded. Run 'apt list --upgradable' to see them.


WARNING: 
apt
 
does not have a stable CLI interface. 
Use with caution in scripts.




Reading package lists...
Building dependency tree...
Reading state information...
autoconf is already the newest version (2.69-11).
The following package was automatically installed and is no longer required:
lsb-base
Use 'apt autoremove' to remove it.
The following additional packages will be installed:
git-man libapr1 libaprutil1 libcurl3-gnutls liberror-perl libexpat1
libpcre2-8-0 libserf-1-1 libsvn1 libutf8proc2
Suggested packages:
gettext-base git-daemon-run | git-daemon-sysvinit git-doc git-el git-email
git-gui gitk gitweb git-cvs git-mediawiki git-svn db5.3-util
libapache2-mod-svn subversion-tools
Recommended packages:
less ssh-client
The following NEW packages will be installed:
build-essential git git-man libapr1 libaprutil1 libcurl3-gnutls
liberror-perl libexpat1 libpcre2-8-0 libserf-1-1 libsvn1 libutf8proc2
subversion
0 upgraded, 13 newly installed, 0 to remove and 2 not upgraded.
Need to get 10.7 MB of archives.
After this operation, 50.2 MB of additional disk space will be used.
Get:1 http://security.debian.org/debian-security buster/updates/main amd64 libcurl3-gnutls amd64 7.64.0-4+deb10u2 [330 kB]
Get:2 http://deb.debian.org/debian buster/main amd64 build-essential amd64 12.6 [7576 B]
Get:3 http://deb.debian.org/debian buster/main amd64 libexpat1 amd64 2.2.6-2+deb10u1 [106 kB]
Get:4 http://deb.debian.org/debian buster/main amd64 libpcre2-8-0 amd64 10.32-5 [213 kB]
Get:5 http://deb.debian.org/debian buster/main amd64 liberror-perl all 0.17027-2 [30.9 kB]
Get:6 http://deb.debian.org/debian buster/main amd64 git-man all 1:2.20.1-2+deb10u3 [1620 kB]
Get:7 http://deb.debian.org/debian buster/main amd64 git amd64 1:2.20.1-2+deb10u3 [5633 kB]
Get:8 http://deb.debian.org/debian buster/main amd64 libapr1 amd64 1.6.5-1+b1 [102 kB]
Get:9 http://deb.debian.org/debian buster/main amd64 libaprutil1 amd64 1.6.1-4 [91.8 kB]
Get:10 http://deb.debian.org/debian buster/main amd64 libserf-1-1 amd64 1.3.9-7+b10 [53.6 kB]
Get:11 http://deb.debian.org/debian buster/main amd64 libutf8proc2 amd64 2.3.0-1 [53.0 kB]
Get:12 http://deb.debian.org/debian buster/main amd64 libsvn1 amd64 1.10.4-1+deb10u2 [1403 kB]
Get:13 http://deb.debian.org/debian buster/main amd64 subversion amd64 1.10.4-1+deb10u2 [1008 kB]
debconf: delaying package configuration, since apt-utils is not installed

Fetched 10.7 MB in 0s (87.2 MB/s)
Selecting previously unselected package build-essential.
(Reading database ...
(Reading database ... 5%
(Reading database ... 10%
(Reading database ... 15%
(Reading database ... 20%
(Reading database ... 25%
(Reading database ... 30%
(Reading database ... 35%
(Reading database ... 40%
(Reading database ... 45%
(Reading database ... 50%
(Reading database ... 55%
(Reading database ... 60%
(Reading database ... 65%
(Reading database ... 70%
(Reading database ... 75%
(Reading database ... 80%
(Reading database ... 85%
(Reading database ... 90%
(Reading database ... 95%
(Reading database ... 100%
(Reading database ...
12690 files and directories currently installed.)
Preparing to unpack .../00-build-essential_12.6_amd64.deb ...
Unpacking build-essential (12.6) ...
Selecting previously unselected package libcurl3-gnutls:amd64.
Preparing to unpack .../01-libcurl3-gnutls_7.64.0-4+deb10u2_amd64.deb ...
Unpacking libcurl3-gnutls:amd64 (7.64.0-4+deb10u2) ...
Selecting previously unselected package libexpat1:amd64.
Preparing to unpack .../02-libexpat1_2.2.6-2+deb10u1_amd64.deb ...
Unpacking libexpat1:amd64 (2.2.6-2+deb10u1) ...
Selecting previously unselected package libpcre2-8-0:amd64.
Preparing to unpack .../03-libpcre2-8-0_10.32-5_amd64.deb ...
Unpacking libpcre2-8-0:amd64 (10.32-5) ...
Selecting previously unselected package liberror-perl.
Preparing to unpack .../04-liberror-perl_0.17027-2_all.deb ...
Unpacking liberror-perl (0.17027-2) ...
Selecting previously unselected package git-man.
Preparing to unpack .../05-git-man_1%3a2.20.1-2+deb10u3_all.deb ...
Unpacking git-man (1:2.20.1-2+deb10u3) ...
Selecting previously unselected package git.
Preparing to unpack .../06-git_1%3a2.20.1-2+deb10u3_amd64.deb ...
Unpacking git (1:2.20.1-2+deb10u3) ...
Selecting previously unselected package libapr1:amd64.
Preparing to unpack .../07-libapr1_1.6.5-1+b1_amd64.deb ...
Unpacking libapr1:amd64 (1.6.5-1+b1) ...
Selecting previously unselected package libaprutil1:amd64.
Preparing to unpack .../08-libaprutil1_1.6.1-4_amd64.deb ...
Unpacking libaprutil1:amd64 (1.6.1-4) ...
Selecting previously unselected package libserf-1-1:amd64.
Preparing to unpack .../09-libserf-1-1_1.3.9-7+b10_amd64.deb ...
Unpacking libserf-1-1:amd64 (1.3.9-7+b10) ...
Selecting previously unselected package libutf8proc2:amd64.
Preparing to unpack .../10-libutf8proc2_2.3.0-1_amd64.deb ...
Unpacking libutf8proc2:amd64 (2.3.0-1) ...
Selecting previously unselected package libsvn1:amd64.
Preparing to unpack .../11-libsvn1_1.10.4-1+deb10u2_amd64.deb ...
Unpacking libsvn1:amd64 (1.10.4-1+deb10u2) ...
Selecting previously unselected package subversion.
Preparing to unpack .../12-subversion_1.10.4-1+deb10u2_amd64.deb ...
Unpacking subversion (1.10.4-1+deb10u2) ...
Setting up libexpat1:amd64 (2.2.6-2+deb10u1) ...
Setting up libutf8proc2:amd64 (2.3.0-1) ...
Setting up libapr1:amd64 (1.6.5-1+b1) ...
Setting up libcurl3-gnutls:amd64 (7.64.0-4+deb10u2) ...
Setting up liberror-perl (0.17027-2) ...
Setting up libpcre2-8-0:amd64 (10.32-5) ...
Setting up build-essential (12.6) ...
Setting up git-man (1:2.20.1-2+deb10u3) ...
Setting up libaprutil1:amd64 (1.6.1-4) ...
Setting up libserf-1-1:amd64 (1.3.9-7+b10) ...
Setting up git (1:2.20.1-2+deb10u3) ...
Setting up libsvn1:amd64 (1.10.4-1+deb10u2) ...
Setting up subversion (1.10.4-1+deb10u2) ...
Processing triggers for libc-bin (2.28-10) ...
Removing intermediate container 158fe685240c
---> 396dbcd124b8
Step 4/4 : RUN svn checkout --revision HEAD https://svn.php.net/repository/pecl/bbcode /tmp/ext-src && cd /tmp/ext-src/trunk && phpize && ./configure --enable-bbcode && make && make test
---> Running in 78856fb9c042
A    ext-src/trunk
A    ext-src/trunk/tests
A    ext-src/trunk/lib
A    ext-src/tags
A    ext-src/tags/bbcode-1.0.3b1
A    ext-src/tags/bbcode-1.0.3b1/tests
A    ext-src/trunk/lib/bstrlib.h
A    ext-src/trunk/package.xml
A    ext-src/trunk/tests/test_28.phpt
A    ext-src/trunk/config.m4
A    ext-src/trunk/tests/test_1.phpt
A    ext-src/trunk/tests/test_29.phpt
A    ext-src/trunk/TODO
A    ext-src/trunk/tests/test_3.phpt
A    ext-src/trunk/tests/test_27.phpt
A    ext-src/tags/bbcode-1.0.3b1/LICENSE
A    ext-src/trunk/tests/test_5.phpt
A    ext-src/trunk/tests/test_26.phpt
A    ext-src/trunk/tests/test_ivy.phpt
A    ext-src/trunk/lib/bbcode2.c
A    ext-src/trunk/tests/test_25.phpt
A    ext-src/trunk/lib/bstrlib.c
A    ext-src/trunk/tests/test_24.phpt
A    ext-src/trunk/config.w32
A    ext-src/trunk/tests/test_21.phpt
A    ext-src/trunk/LICENSE
A    ext-src/trunk/tests/test_22.phpt
A    ext-src/trunk/CREDITS
A    ext-src/trunk/tests/test_23.phpt
A    ext-src/tags/bbcode-1.0.3b1/tests/test_9.phpt
A    ext-src/trunk/tests/test_20.phpt
A    ext-src/tags/bbcode-1.0.3b1/tests/test_8.phpt
A    ext-src/tags/bbcode-1.0.3b1/tests/test_12.phpt
A    ext-src/trunk/tests/test_19.phpt
A    ext-src/tags/bbcode-1.0.3b1/tests/test_20.phpt
A    ext-src/tags/bbcode-1.0.3b1/tests/test_10.phpt
A    ext-src/trunk/tests/test_17.phpt
A    ext-src/tags/bbcode-1.0.3b1/tests/test_21.phpt
A    ext-src/trunk/tests/test_18.phpt
A    ext-src/tags/bbcode-1.0.3b1/lib
A    ext-src/tags/bbcode-1.0.3b1/tests/test_14.phpt
A    ext-src/tags/bbcode-1.0.3b1/tests/test_22.phpt
A    ext-src/tags/bbcode-1.0.3b1/tests/test_23.phpt
A    ext-src/trunk/tests/test_14.phpt
A    ext-src/tags/bbcode-1.0.3b1/tests/test_15.phpt
A    ext-src/tags/RELEASE_1_0_2
A    ext-src/tags/RELEASE_1_0_2/tests
A    ext-src/trunk/tests/test_15.phpt
A    ext-src/tags/bbcode-1.0.3b1/tests/test_25.phpt
A    ext-src/trunk/tests/test_16.phpt
A    ext-src/tags/bbcode-1.0.3b1/tests/test_16.phpt
A    ext-src/tags/bbcode-1.0.3b1/tests/test_26.phpt
A    ext-src/tags/bbcode-1.0.3b1/tests/test_18.phpt
A    ext-src/trunk/tests/test_9.phpt
A    ext-src/trunk/tests/test_10.phpt
A    ext-src/tags/bbcode-1.0.3b1/tests/test_2.phpt
A    ext-src/tags/bbcode-1.0.3b1/tests/test_27.phpt
A    ext-src/tags/bbcode-1.0.3b1/tests/test_1.phpt
A    ext-src/trunk/tests/test_11.phpt
A    ext-src/tags/bbcode-1.0.3b1/tests/test_3.phpt
A    ext-src/trunk/tests/test_12.phpt
A    ext-src/tags/bbcode-1.0.3b1/tests/test_6.phpt
A    ext-src/tags/bbcode-1.0.3b1/tests/test_5.phpt
A    ext-src/tags/bbcode-1.0.3b1/config.m4
A    ext-src/trunk/tests/test_13.phpt
A    ext-src/trunk/tests/test_8.phpt
A    ext-src/tags/bbcode-1.0.3b1/lib/bbcode2.h
A    ext-src/tags/bbcode-1.0.3b1/lib/bbcode2.c
A    ext-src/trunk/tests/test_7.phpt
A    ext-src/tags/bbcode-1.0.3b1/CREDITS
A    ext-src/trunk/tests/test_2.phpt
A    ext-src/tags/bbcode-1.0.3b1/php_bbcode.c
A    ext-src/tags/bbcode-1.0.3b1/lib/bstrlib.c
A    ext-src/tags/bbcode-1.0.3b1/php_bbcode.h
A    ext-src/tags/RELEASE_1_0_2/lib
A    ext-src/trunk/tests/test_4.phpt
A    ext-src/tags/RELEASE_1_0_2/tests/test_22.phpt
A    ext-src/tags/RELEASE_1_0_2/tests/test_24.phpt
A    ext-src/trunk/tests/test_6.phpt
A    ext-src/trunk/lib/bbcode2.h
A    ext-src/tags/RELEASE_1_0_2/tests/test_21.phpt
A    ext-src/tags/RELEASE_1_0_2/tests/test_19.phpt
A    ext-src/tags/RELEASE_1_0_2/tests/test_20.phpt
A    ext-src/tags/RELEASE_1_0_2/tests/test_17.phpt
A    ext-src/tags/RELEASE_1_0_1
A    ext-src/tags/RELEASE_1_0_1/tests
A    ext-src/tags/RELEASE_1_0_2/tests/test_14.phpt
A    ext-src/tags/RELEASE_1_0_2/tests/test_15.phpt
A    ext-src/tags/RELEASE_1_0_2/tests/test_16.phpt
A    ext-src/trunk/php_bbcode.c
A    ext-src/tags/RELEASE_1_0_2/tests/test_10.phpt
A    ext-src/tags/RELEASE_1_0_2/tests/test_11.phpt
A    ext-src/trunk/php_bbcode.h
A    ext-src/tags/RELEASE_1_0_2/tests/test_8.phpt
A    ext-src/tags/RELEASE_1_0_2/tests/test_12.phpt
A    ext-src/tags/RELEASE_1_0_2/tests/test_7.phpt
A    ext-src/trunk/bbcode.php
A    ext-src/tags/RELEASE_1_0_2/tests/test_1.phpt
A    ext-src/tags/bbcode-1.0.3b1/tests/test_7.phpt
A    ext-src/tags/RELEASE_1_0_2/tests/test_4.phpt
A    ext-src/tags/RELEASE_1_0_2/tests/test_3.phpt
A    ext-src/tags/RELEASE_1_0_2/tests/test_5.phpt
A    ext-src/tags/bbcode-1.0.3b1/tests/test_11.phpt
A    ext-src/tags/bbcode-1.0.3b1/tests/test_13.phpt
A    ext-src/tags/RELEASE_1_0_2/lib/bbcode2.c
A    ext-src/tags/RELEASE_1_0_2/lib/bbcode2.h
A    ext-src/tags/bbcode-1.0.3b1/tests/test_24.phpt
A    ext-src/tags/bbcode-1.0.3b1/tests/test_17.phpt
A    ext-src/tags/RELEASE_1_0_2/lib/bstrlib.c
A    ext-src/tags/RELEASE_1_0_2/php_bbcode.c
A    ext-src/tags/RELEASE_1_0_2/php_bbcode.h
A    ext-src/tags/bbcode-1.0.3b1/tests/test_19.phpt
A    ext-src/tags/RELEASE_1_0_2/package2.xml
A    ext-src/tags/RELEASE_1_0_2/config.m4
A    ext-src/tags/RELEASE_1_0_1/lib
A    ext-src/tags/RELEASE_1_0_2/TODO
A    ext-src/tags/bbcode-1.0.3b1/tests/test_4.phpt
A    ext-src/tags/RELEASE_1_0_2/CREDITS
A    ext-src/tags/bbcode-1.0.3b1/TODO
A    ext-src/tags/RELEASE_1_0_1/tests/test_21.phpt
A    ext-src/tags/RELEASE_1_0_1/tests/test_23.phpt
A    ext-src/tags/RELEASE_1_0_1/tests/test_22.phpt
A    ext-src/tags/RELEASE_1_0_1/tests/test_19.phpt
A    ext-src/tags/bbcode-1.0.3b1/lib/bstrlib.h
A    ext-src/tags/RELEASE_1_0_0
A    ext-src/tags/RELEASE_1_0_0/tests
A    ext-src/tags/RELEASE_1_0_1/tests/test_17.phpt
A    ext-src/tags/RELEASE_1_0_1/tests/test_18.phpt
A    ext-src/tags/RELEASE_1_0_1/tests/test_15.phpt
A    ext-src/tags/RELEASE_1_0_2/tests/test_25.phpt
A    ext-src/tags/RELEASE_1_0_1/tests/test_16.phpt
A    ext-src/tags/RELEASE_1_0_1/tests/test_9.phpt
A    ext-src/tags/RELEASE_1_0_1/tests/test_11.phpt
A    ext-src/tags/RELEASE_1_0_2/tests/test_23.phpt
A    ext-src/tags/RELEASE_1_0_1/tests/test_12.phpt
A    ext-src/tags/RELEASE_1_0_1/tests/test_13.phpt
A    ext-src/tags/RELEASE_1_0_2/tests/test_18.phpt
A    ext-src/tags/RELEASE_1_0_1/tests/test_1.phpt
A    ext-src/tags/RELEASE_1_0_1/tests/test_7.phpt
A    ext-src/tags/RELEASE_1_0_1/tests/test_2.phpt
A    ext-src/tags/RELEASE_1_0_2/tests/test_9.phpt
A    ext-src/tags/RELEASE_1_0_2/tests/test_13.phpt
A    ext-src/tags/RELEASE_1_0_1/tests/test_5.phpt
A    ext-src/tags/RELEASE_1_0_1/tests/test_4.phpt
A    ext-src/tags/RELEASE_1_0_1/tests/test_6.phpt
A    ext-src/tags/RELEASE_1_0_2/tests/test_2.phpt
A    ext-src/tags/RELEASE_1_0_1/package2.xml
A    ext-src/tags/RELEASE_1_0_2/tests/test_6.phpt
A    ext-src/tags/RELEASE_1_0_1/lib/bbcode2.c
A    ext-src/tags/RELEASE_1_0_2/lib/bstrlib.h
A    ext-src/tags/RELEASE_1_0_0/lib
A    ext-src/tags/RELEASE_1_0_1/lib/bstrlib.h
A    ext-src/tags/RELEASE_1_0_1/php_bbcode.c
A    ext-src/tags/RELEASE_1_0_2/LICENSE
A    ext-src/tags/RELEASE_1_0_1/config.m4
A    ext-src/tags/RELEASE_1_0_1/CREDITS
A    ext-src/tags/RELEASE_1_0_1/lib/bbcode2.h
A    ext-src/tags/RELEASE_1_0_1/tests/test_24.phpt
A    ext-src/tags/RELEASE_1_0_0/tests/test_22.phpt
A    ext-src/tags/RELEASE_1_0_0/tests/test_23.phpt
A    ext-src/tags/RELEASE_0_10_4
A    ext-src/tags/RELEASE_0_10_4/tests
A    ext-src/tags/RELEASE_1_0_1/LICENSE
A    ext-src/tags/RELEASE_1_0_1/tests/test_20.phpt
A    ext-src/tags/RELEASE_1_0_0/tests/test_17.phpt
A    ext-src/tags/RELEASE_1_0_0/tests/test_18.phpt
A    ext-src/tags/RELEASE_1_0_0/tests/test_24.phpt
A    ext-src/tags/RELEASE_1_0_1/tests/test_14.phpt
A    ext-src/tags/RELEASE_1_0_0/tests/test_16.phpt
A    ext-src/tags/RELEASE_1_0_0/tests/test_9.phpt
A    ext-src/tags/RELEASE_1_0_0/tests/test_20.phpt
A    ext-src/tags/RELEASE_1_0_1/tests/test_10.phpt
A    ext-src/tags/RELEASE_1_0_0/tests/test_12.phpt
A    ext-src/tags/RELEASE_1_0_0/tests/test_13.phpt
A    ext-src/tags/RELEASE_1_0_0/tests/test_14.phpt
A    ext-src/tags/RELEASE_1_0_1/tests/test_8.phpt
A    ext-src/tags/RELEASE_1_0_0/tests/test_1.phpt
A    ext-src/tags/RELEASE_1_0_0/tests/test_2.phpt
A    ext-src/tags/RELEASE_1_0_1/tests/test_3.phpt
A    ext-src/tags/RELEASE_1_0_0/tests/test_10.phpt
A    ext-src/tags/RELEASE_1_0_0/tests/test_5.phpt
A    ext-src/tags/RELEASE_1_0_0/tests/test_8.phpt
A    ext-src/tags/RELEASE_1_0_1/php_bbcode.h
A    ext-src/tags/RELEASE_1_0_0/tests/test_3.phpt
A    ext-src/tags/RELEASE_1_0_0/TODO
A    ext-src/tags/RELEASE_0_10_4/lib
A    ext-src/tags/RELEASE_1_0_0/tests/test_6.phpt
A    ext-src/tags/RELEASE_1_0_0/package2.xml
A    ext-src/tags/RELEASE_1_0_0/lib/bstrlib.h
A    ext-src/tags/RELEASE_1_0_0/lib/bbcode2.c
A    ext-src/tags/RELEASE_1_0_1/lib/bstrlib.c
A    ext-src/tags/RELEASE_1_0_0/lib/bbcode2.h
A    ext-src/tags/RELEASE_1_0_0/CREDITS
A    ext-src/tags/RELEASE_1_0_0/php_bbcode.c
A    ext-src/tags/RELEASE_1_0_1/TODO
A    ext-src/tags/RELEASE_0_10_3
A    ext-src/tags/RELEASE_0_10_3/tests
A    ext-src/tags/RELEASE_1_0_0/php_bbcode.h
A    ext-src/tags/RELEASE_0_10_4/tests/test_23.phpt
A    ext-src/tags/RELEASE_0_10_4/tests/test_24.phpt
A    ext-src/tags/RELEASE_1_0_0/tests/test_21.phpt
A    ext-src/tags/RELEASE_0_10_4/tests/test_21.phpt
A    ext-src/tags/RELEASE_0_10_4/tests/test_18.phpt
A    ext-src/tags/RELEASE_0_10_4/tests/test_20.phpt
A    ext-src/tags/RELEASE_1_0_0/tests/test_19.phpt
A    ext-src/tags/RELEASE_0_10_4/tests/test_19.phpt
A    ext-src/tags/RELEASE_0_10_4/tests/test_14.phpt
A    ext-src/tags/RELEASE_1_0_0/tests/test_15.phpt
A    ext-src/tags/RELEASE_0_10_4/tests/test_9.phpt
A    ext-src/tags/RELEASE_0_10_4/tests/test_15.phpt
A    ext-src/tags/RELEASE_0_10_4/tests/test_10.phpt
A    ext-src/tags/RELEASE_1_0_0/tests/test_11.phpt
A    ext-src/tags/RELEASE_0_10_4/tests/test_11.phpt
A    ext-src/tags/RELEASE_0_10_4/tests/test_13.phpt
A    ext-src/tags/RELEASE_0_10_4/tests/test_8.phpt
A    ext-src/tags/RELEASE_1_0_0/tests/test_7.phpt
A    ext-src/tags/RELEASE_0_10_4/tests/test_7.phpt
A    ext-src/tags/RELEASE_0_10_4/tests/test_2.phpt
A    ext-src/tags/RELEASE_1_0_0/tests/test_4.phpt
A    ext-src/tags/RELEASE_0_10_4/tests/test_3.phpt
A    ext-src/tags/RELEASE_0_10_4/tests/test_4.phpt
A    ext-src/tags/RELEASE_0_10_4/tests/test_6.phpt
A    ext-src/tags/RELEASE_0_10_3/lib
A    ext-src/tags/RELEASE_1_0_0/LICENSE
A    ext-src/tags/RELEASE_0_10_4/lib/bstrlib.h
A    ext-src/tags/RELEASE_0_10_4/lib/bbcode2.h
A    ext-src/tags/RELEASE_0_10_4/lib/bbcode2.c
A    ext-src/tags/RELEASE_1_0_0/lib/bstrlib.c
A    ext-src/tags/RELEASE_0_10_4/config.m4
A    ext-src/tags/RELEASE_0_10_4/package2.xml
A    ext-src/tags/RELEASE_0_10_2
A    ext-src/tags/RELEASE_0_10_2/lib
A    ext-src/tags/RELEASE_0_10_4/php_bbcode.c
A    ext-src/tags/RELEASE_1_0_0/config.m4
A    ext-src/tags/RELEASE_0_10_3/tests/test_23.phpt
A    ext-src/tags/RELEASE_0_10_4/CREDITS
A    ext-src/tags/RELEASE_0_10_3/tests/test_21.phpt
A    ext-src/tags/RELEASE_0_10_4/tests/test_22.phpt
A    ext-src/tags/RELEASE_0_10_3/tests/test_18.phpt
A    ext-src/tags/RELEASE_0_10_3/tests/test_19.phpt
A    ext-src/tags/RELEASE_0_10_2/tests
A    ext-src/tags/RELEASE_0_10_3/tests/test_20.phpt
A    ext-src/tags/RELEASE_0_10_4/tests/test_17.phpt
A    ext-src/tags/RELEASE_0_10_3/tests/test_9.phpt
A    ext-src/tags/RELEASE_0_10_3/tests/test_15.phpt
A    ext-src/tags/RELEASE_0_10_3/tests/test_14.phpt
A    ext-src/tags/RELEASE_0_10_4/tests/test_16.phpt
A    ext-src/tags/RELEASE_0_10_3/tests/test_11.phpt
A    ext-src/tags/RELEASE_0_10_3/tests/test_10.phpt
A    ext-src/tags/RELEASE_0_10_3/tests/test_13.phpt
A    ext-src/tags/RELEASE_0_10_4/tests/test_12.phpt
A    ext-src/tags/RELEASE_0_10_3/tests/test_7.phpt
A    ext-src/tags/RELEASE_0_10_3/tests/test_8.phpt
A    ext-src/tags/RELEASE_0_10_3/tests/test_2.phpt
A    ext-src/tags/RELEASE_0_10_4/tests/test_1.phpt
A    ext-src/tags/RELEASE_0_10_3/tests/test_4.phpt
A    ext-src/tags/RELEASE_0_10_3/tests/test_3.phpt
A    ext-src/tags/RELEASE_0_10_3/tests/test_6.phpt
A    ext-src/tags/RELEASE_0_10_4/tests/test_5.phpt
A    ext-src/tags/RELEASE_0_10_3/package2.xml
A    ext-src/tags/RELEASE_0_10_1
A    ext-src/tags/RELEASE_0_10_4/lib/bstrlib.c
A    ext-src/tags/RELEASE_0_10_3/lib/bbcode2.c
A    ext-src/tags/RELEASE_0_10_3/lib/bstrlib.h
A    ext-src/tags/RELEASE_0_10_3/lib/bstrlib.c
A    ext-src/tags/RELEASE_0_10_4/php_bbcode.h
A    ext-src/tags/RELEASE_0_10_1/lib
A    ext-src/tags/RELEASE_0_10_3/CREDITS
A    ext-src/tags/RELEASE_0_10_3/php_bbcode.c
A    ext-src/tags/RELEASE_0_10_3/config.m4
A    ext-src/tags/RELEASE_0_10_3/tests/test_22.phpt
A    ext-src/tags/RELEASE_0_10_1/tests
A    ext-src/tags/RELEASE_0_10_2/lib/bstrlib.h
A    ext-src/tags/RELEASE_0_10_3/tests/test_17.phpt
A    ext-src/tags/RELEASE_0_10_2/lib/bbcode2.c
A    ext-src/tags/RELEASE_0_10_2/lib/bstrlib.c
A    ext-src/tags/RELEASE_0_10_2/tests/test_17.phpt
A    ext-src/tags/RELEASE_0_10_3/tests/test_16.phpt
A    ext-src/tags/RELEASE_0_10_2/php_bbcode.h
A    ext-src/tags/RELEASE_0_10_2/tests/test_19.phpt
A    ext-src/tags/RELEASE_0_10_2/tests/test_16.phpt
A    ext-src/tags/RELEASE_0_10_3/tests/test_12.phpt
A    ext-src/tags/RELEASE_0_10_2/tests/test_18.phpt
A    ext-src/tags/RELEASE_0_10_2/tests/test_15.phpt
A    ext-src/tags/RELEASE_0_10_2/tests/test_12.phpt
A    ext-src/tags/RELEASE_0_10_2/tests/test_9.phpt
A    ext-src/tags/RELEASE_0_10_2/tests/test_11.phpt
A    ext-src/tags/RELEASE_0_10_2/tests/test_1.phpt
A    ext-src/tags/RELEASE_0_10_2/tests/test_13.phpt
A    ext-src/tags/RELEASE_0_10_2/tests/test_7.phpt
A    ext-src/tags/RELEASE_0_10_0
A    ext-src/tags/RELEASE_0_10_0/lib
A    ext-src/tags/RELEASE_0_10_3/tests/test_1.phpt
A    ext-src/tags/RELEASE_0_10_2/tests/test_5.phpt
A    ext-src/tags/RELEASE_0_10_2/tests/test_2.phpt
A    ext-src/tags/RELEASE_0_10_2/tests/test_4.phpt
A    ext-src/tags/RELEASE_0_10_0/tests
A    ext-src/tags/RELEASE_0_10_3/tests/test_5.phpt
A    ext-src/tags/RELEASE_0_10_2/CREDITS
A    ext-src/tags/RELEASE_0_10_2/tests/test_6.phpt
A    ext-src/tags/RELEASE_0_10_2/config.m4
A    ext-src/tags/RELEASE_0_10_3/lib/bbcode2.h
A    ext-src/tags/RELEASE_0_10_1/lib/bstrlib.h
A    ext-src/tags/RELEASE_0_10_3/php_bbcode.h
A    ext-src/tags/RELEASE_0_10_1/lib/bstrlib.c
A    ext-src/tags/RELEASE_0_10_1/tests/test_12.phpt
A    ext-src/tags/RELEASE_0_10_1/lib/bbcode2.c
A    ext-src/tags/RELEASE_0_10_1/tests/test_11.phpt
A    ext-src/tags/RELEASE_0_10_2/lib/bbcode2.h
A    ext-src/tags/RELEASE_0_10_1/tests/test_1.phpt
A    ext-src/tags/RELEASE_0_10_1/tests/test_9.phpt
A    ext-src/tags/RELEASE_0_9_1
A    ext-src/tags/RELEASE_0_9_1/tests
A    ext-src/tags/RELEASE_0_10_2/package2.xml
A    ext-src/tags/RELEASE_0_10_1/tests/test_7.phpt
A    ext-src/tags/RELEASE_0_10_1/tests/test_5.phpt
A    ext-src/tags/RELEASE_0_10_1/tests/test_13.phpt
A    ext-src/tags/RELEASE_0_10_2/tests/test_14.phpt
A    ext-src/tags/RELEASE_0_10_1/config.m4
A    ext-src/tags/RELEASE_0_10_1/tests/test_2.phpt
A    ext-src/tags/RELEASE_0_10_1/tests/test_4.phpt
A    ext-src/tags/RELEASE_0_10_2/tests/test_10.phpt
A    ext-src/tags/RELEASE_0_9_1/lib
A    ext-src/tags/RELEASE_0_10_1/package2.xml
A    ext-src/tags/RELEASE_0_10_1/tests/test_6.phpt
A    ext-src/tags/RELEASE_0_10_2/tests/test_8.phpt
A    ext-src/tags/RELEASE_0_10_1/php_bbcode.h
A    ext-src/tags/RELEASE_0_10_1/EXPERIMENTAL
A    ext-src/tags/RELEASE_0_10_2/tests/test_3.phpt
A    ext-src/tags/RELEASE_0_10_0/lib/bbcode2.h
A    ext-src/tags/RELEASE_0_10_0/lib/bbcode2.c
A    ext-src/tags/RELEASE_0_10_0/lib/bstrlib.h
A    ext-src/tags/RELEASE_0_9_0
A    ext-src/tags/RELEASE_0_9_0/tests
A    ext-src/tags/RELEASE_0_10_2/php_bbcode.c
A    ext-src/tags/RELEASE_0_10_0/tests/test_9.phpt
A    ext-src/tags/RELEASE_0_10_0/tests/test_8.phpt
A    ext-src/tags/RELEASE_0_9_0/lib
A    ext-src/tags/RELEASE_0_10_0/tests/test_1.phpt
A    ext-src/tags/RELEASE_0_10_1/lib/bbcode2.h
A    ext-src/tags/RELEASE_0_10_0/tests/test_3.phpt
A    ext-src/tags/RELEASE_0_10_0/tests/test_2.phpt
A    ext-src/tags/RELEASE_0_10_0/tests/test_5.phpt
A    ext-src/tags/RELEASE_0_10_1/tests/test_10.phpt
A    ext-src/tags/RELEASE_0_10_0/config.m4
A    ext-src/tags/RELEASE_0_10_0/tests/test_6.phpt
A    ext-src/tags/RELEASE_0_10_0/php_bbcode.c
A    ext-src/tags/RELEASE_0_10_1/tests/test_8.phpt
A    ext-src/tags/RELEASE_0_10_0/CREDITS
A    ext-src/tags/RELEASE_0_10_0/php_bbcode.h
A    ext-src/tags/RELEASE_0_9_1/tests/test_1.phpt
A    ext-src/tags/RELEASE_0_10_1/tests/test_3.phpt
A    ext-src/branches
A    ext-src/tags/RELEASE_0_9_1/tests/test_3.phpt
A    ext-src/tags/RELEASE_0_9_1/tests/test_2.phpt
A    ext-src/tags/RELEASE_0_9_1/tests/test_5.phpt
A    ext-src/tags/RELEASE_0_10_1/php_bbcode.c
A    ext-src/tags/RELEASE_0_9_1/config.m4
A    ext-src/tags/RELEASE_0_9_1/package2.xml
A    ext-src/tags/RELEASE_0_10_1/CREDITS
A    ext-src/tags/RELEASE_0_9_1/lib/bbcode.c
A    ext-src/tags/RELEASE_0_9_1/lib/stacklib.h
A    ext-src/tags/RELEASE_0_9_1/lib/stacklib.c
A    ext-src/tags/RELEASE_0_9_1/php_bbcode.c
A    ext-src/tags/RELEASE_0_10_0/lib/bstrlib.c
A    ext-src/tags/RELEASE_0_9_1/lib/bstrlib.c
A    ext-src/tags/RELEASE_0_10_0/tests/test_7.phpt
A    ext-src/tags/RELEASE_0_9_0/tests/test_1.phpt
A    ext-src/tags/RELEASE_0_9_1/EXPERIMENTAL
A    ext-src/tags/RELEASE_0_9_1/php_bbcode.h
A    ext-src/tags/RELEASE_0_9_0/tests/test_5.phpt
A    ext-src/tags/RELEASE_0_10_0/tests/test_4.phpt
A    ext-src/tags/RELEASE_0_9_0/tests/test_4.phpt
A    ext-src/tags/RELEASE_0_9_0/tests/test_2.phpt
A    ext-src/tags/RELEASE_0_9_0/lib/stacklib.h
A    ext-src/tags/RELEASE_0_10_0/package2.xml
A    ext-src/tags/RELEASE_0_9_0/lib/bbcode.c
A    ext-src/tags/RELEASE_0_9_0/package2.xml
A    ext-src/tags/RELEASE_0_10_0/EXPERIMENTAL
A    ext-src/tags/RELEASE_0_9_0/php_bbcode.c
A    ext-src/tags/RELEASE_0_9_0/lib/stacklib.c
A    ext-src/tags/RELEASE_0_9_0/lib/bstrlib.c
A    ext-src/tags/RELEASE_0_9_1/tests/test_4.phpt
A    ext-src/tags/RELEASE_0_9_0/CREDITS
A    ext-src/tags/RELEASE_0_9_0/EXPERIMENTAL
A    ext-src/tags/RELEASE_0_9_0/config.m4
A    ext-src/tags/RELEASE_0_9_1/lib/bbcode.h
A    ext-src/tags/RELEASE_0_9_1/lib/bstrlib.h
A    ext-src/tags/RELEASE_0_9_1/CREDITS
A    ext-src/tags/RELEASE_0_9_0/tests/test_3.phpt
A    ext-src/tags/RELEASE_0_9_0/lib/bbcode.h
A    ext-src/tags/RELEASE_0_9_0/lib/bstrlib.h
A    ext-src/tags/RELEASE_0_9_0/php_bbcode.h
Checked out revision 352318.
Configuring for:
PHP Api Version:         20200930
Zend Module Api No:      20200930
Zend Extension Api No:   420200930
checking for grep that handles long lines and -e...
/bin/grep
checking for egrep...
/bin/grep -E
checking for a sed that does not truncate output...
/bin/sed
checking for pkg-config...
/usr/bin/pkg-config
checking pkg-config is at least version 0.9.0...
yes
checking for cc...
cc
checking whether the C compiler works...
yes
checking for C compiler default output file name...
a.out
checking for suffix of executables...
checking whether we are cross compiling...
no
checking for suffix of object files...
o
checking whether we are using the GNU C compiler...
yes
checking whether cc accepts -g...
yes
checking for cc option to accept ISO C89...
none needed
checking how to run the C preprocessor...
cc -E
checking for icc...
no
checking for suncc...
no
checking for system library directory...
lib
checking if compiler supports -R...
no
checking if compiler supports -Wl,-rpath,...
yes
checking build system type...
x86_64-pc-linux-gnu
checking host system type...
x86_64-pc-linux-gnu
checking target system type...
x86_64-pc-linux-gnu
checking for PHP prefix...
/usr/local
checking for PHP includes...
-I/usr/local/include/php -I/usr/local/include/php/main -I/usr/local/include/php/TSRM -I/usr/local/include/php/Zend -I/usr/local/include/php/ext -I/usr/local/include/php/ext/date/lib
checking for PHP extension directory...
/usr/local/lib/php/extensions/no-debug-non-zts-20200930
checking for PHP installed headers prefix...
/usr/local/include/php
checking if debug is enabled...
no
checking if zts is enabled...
no
checking for gawk...
no
checking for nawk...
nawk
checking if nawk is broken...
no
checking whether to enable C based BBCode support...
yes, shared
checking for a sed that does not truncate output...
/bin/sed
checking for ld used by cc...
/usr/bin/ld
checking if the linker (/usr/bin/ld) is GNU ld...
yes
checking for /usr/bin/ld option to reload object files...
-r
checking for BSD-compatible nm...
/usr/bin/nm -B
checking whether ln -s works...
yes
checking how to recognize dependent libraries...
pass_all
checking for ANSI C header files...
yes
checking for sys/types.h...
yes
checking for sys/stat.h...
yes
checking for stdlib.h...
yes
checking for string.h...
yes
checking for memory.h...
yes
checking for strings.h...
yes
checking for inttypes.h...
yes
checking for stdint.h...
yes
checking for unistd.h...
yes
checking dlfcn.h usability...
yes
checking dlfcn.h presence...
yes
checking for dlfcn.h...
yes
checking the maximum length of command line arguments...
1572864
checking command to parse /usr/bin/nm -B output from cc object...
ok
checking for objdir...
.libs
checking for ar...
ar
checking for ranlib...
ranlib
checking for strip...
strip
checking if cc supports -fno-rtti -fno-exceptions...
no
checking for cc option to produce PIC...
-fPIC
checking if cc PIC flag -fPIC works...
yes
checking if cc static flag -static works...
yes
checking if cc supports -c -o file.o...
yes
checking whether the cc linker (/usr/bin/ld -m elf_x86_64) supports shared libraries...
yes
checking whether -lc should be explicitly linked in...
no
checking dynamic linker characteristics...
GNU/Linux ld.so
checking how to hardcode library paths into programs...
immediate
checking whether stripping libraries is possible...
yes
checking if libtool supports shared libraries...
yes
checking whether to build shared libraries...
yes
checking whether to build static libraries...
no
creating libtool
appending configuration tag "CXX" to libtool
configure: patching config.h.in
configure: creating ./config.status
config.status: creating config.h
/bin/bash /tmp/ext-src/trunk/libtool --mode=compile cc -I. -I/tmp/ext-src/trunk -I/tmp/ext-src/trunk/include -I/tmp/ext-src/trunk/main -I/tmp/ext-src/trunk -I/usr/local/include/php -I/usr/local/include/php/main -I/usr/local/include/php/TSRM -I/usr/local/include/php/Zend -I/usr/local/include/php/ext -I/usr/local/include/php/ext/date/lib  -DHAVE_CONFIG_H  -g -O2   -I/tmp/ext-src/trunk/lib -c /tmp/ext-src/trunk/php_bbcode.c -o php_bbcode.lo
mkdir .libs
cc -I. -I/tmp/ext-src/trunk -I/tmp/ext-src/trunk/include -I/tmp/ext-src/trunk/main -I/tmp/ext-src/trunk -I/usr/local/include/php -I/usr/local/include/php/main -I/usr/local/include/php/TSRM -I/usr/local/include/php/Zend -I/usr/local/include/php/ext -I/usr/local/include/php/ext/date/lib -DHAVE_CONFIG_H -g -O2 -I/tmp/ext-src/trunk/lib -c /tmp/ext-src/trunk/php_bbcode.c  -fPIC -DPIC -o .libs/php_bbcode.o
/tmp/ext-src/trunk/php_bbcode.c: In function '_php_bbcode_callback_handler':

/tmp/ext-src/trunk/php_bbcode.c:46:2: warning: implicit declaration of function 'TSRMLS_FETCH'; did you mean 'TSRMLS_CACHE'? [-Wimplicit-function-declaration]
  TSRMLS_FETCH();
  ^~~~~~~~~~~~
  TSRMLS_CACHE

/tmp/ext-src/trunk/php_bbcode.c:60:2: warning: implicit declaration of function 'MAKE_STD_ZVAL' [-Wimplicit-function-declaration]
  MAKE_STD_ZVAL(*zargs[0]);
  ^~~~~~~~~~~~~

/tmp/ext-src/trunk/php_bbcode.c:61:61: error: macro "ZVAL_STRINGL" passed 4 arguments, but takes just 3
  ZVAL_STRINGL(*zargs[0], bdata(content), blength(content), 1);
                                                             ^

/tmp/ext-src/trunk/php_bbcode.c:61:2: error: 'ZVAL_STRINGL' undeclared (first use in this function); did you mean 'ZEND_STR_INT'?
  ZVAL_STRINGL(*zargs[0], bdata(content), blength(content), 1);
  ^~~~~~~~~~~~
  ZEND_STR_INT

/tmp/ext-src/trunk/php_bbcode.c:61:2: note: each undeclared identifier is reported only once for each function it appears in

/tmp/ext-src/trunk/php_bbcode.c:64:57: error: macro "ZVAL_STRINGL" passed 4 arguments, but takes just 3
  ZVAL_STRINGL(*zargs[1], bdata(param), blength(param), 1);
                                                         ^

/tmp/ext-src/trunk/php_bbcode.c:66:8: warning: implicit declaration of function 'call_user_function_ex'; did you mean 'call_user_function'? [-Wimplicit-function-declaration]
  res = call_user_function_ex(EG(function_table), NULL, func_name, &retval, 2, zargs, 1, NULL TSRMLS_CC);
        ^~~~~~~~~~~~~~~~~~~~~
        call_user_function

/tmp/ext-src/trunk/php_bbcode.c:66:94: error: expected ')' before 'TSRMLS_CC'
  res = call_user_function_ex(EG(function_table), NULL, func_name, &retval, 2, zargs, 1, NULL TSRMLS_CC);
                                                                                              ^~~~~~~~~

/tmp/ext-src/trunk/php_bbcode.c:69:48: error: expected ')' before 'TSRMLS_CC'
   if (!zend_is_callable(func_name, 0, &callable TSRMLS_CC)) {
                                                ^~~~~~~~~~
                                                )

/tmp/ext-src/trunk/php_bbcode.c:69:39: warning: passing argument 3 of 'zend_is_callable' from incompatible pointer type [-Wincompatible-pointer-types]
   if (!zend_is_callable(func_name, 0, &callable TSRMLS_CC)) {
                                       ^~~~~~~~~

In file included from /usr/local/include/php/main/php.h:35,
                 from /tmp/ext-src/trunk/php_bbcode.c:25:
/usr/local/include/php/Zend/zend_API.h:359:89: note: expected 'zend_string **' {aka 'struct _zend_string **'} but argument is of type 'char **'
 ZEND_API zend_bool zend_is_callable(zval *callable, uint32_t check_flags, zend_string **callable_name);
                                                                           ~~~~~~~~~~~~~~^~~~~~~~~~~~~

/tmp/ext-src/trunk/php_bbcode.c:70:26: error: expected ')' before 'TSRMLS_CC'
    php_error_docref(NULL TSRMLS_CC, E_WARNING, "function `%s' is not callable", callable);
                          ^~~~~~~~~

/tmp/ext-src/trunk/php_bbcode.c:70:4: error: too few arguments to function 'php_error_docref'
    php_error_docref(NULL TSRMLS_CC, E_WARNING, "function `%s' is not callable", callable);
    ^~~~~~~~~~~~~~~~

In file included from /tmp/ext-src/trunk/php_bbcode.c:25:
/usr/local/include/php/main/php.h:341:23: note: declared here
 PHPAPI ZEND_COLD void php_error_docref(const char *docref, int type, const char *format, ...)
                       ^~~~~~~~~~~~~~~~

/tmp/ext-src/trunk/php_bbcode.c:72:26: error: expected ')' before 'TSRMLS_CC'
    php_error_docref(NULL TSRMLS_CC, E_WARNING, "callback function %s() failed", callable);
                          ^~~~~~~~~

/tmp/ext-src/trunk/php_bbcode.c:72:4: error: too few arguments to function 'php_error_docref'
    php_error_docref(NULL TSRMLS_CC, E_WARNING, "callback function %s() failed", callable);
    ^~~~~~~~~~~~~~~~

In file included from /tmp/ext-src/trunk/php_bbcode.c:25:
/usr/local/include/php/main/php.h:341:23: note: declared here
 PHPAPI ZEND_COLD void php_error_docref(const char *docref, int type, const char *format, ...)
                       ^~~~~~~~~~~~~~~~

In file included from /usr/local/include/php/Zend/zend.h:27,
                 from /usr/local/include/php/main/php.h:31,
                 from /tmp/ext-src/trunk/php_bbcode.c:25:
/usr/local/include/php/Zend/zend_types.h:562:39: warning: passing argument 1 of 'zval_get_type' from incompatible pointer type [-Wincompatible-pointer-types]
 #define Z_TYPE(zval)    zval_get_type(&(zval))
                                       ^~~~~~~
/usr/local/include/php/Zend/zend_types.h:563:28: note: in expansion of macro 'Z_TYPE'
 #define Z_TYPE_P(zval_p)   Z_TYPE(*(zval_p))
                            ^~~~~~
/usr/local/include/php/Zend/zend_operators.h:448:6: note: in expansion of macro 'Z_TYPE_P'
  if (Z_TYPE_P(pzv)!=upper_type) {     \
      ^~~~~~~~
/usr/local/include/php/Zend/zend_operators.h:496:35: note: in expansion of macro 'convert_to_ex_master'
 #define convert_to_string_ex(pzv) convert_to_ex_master(pzv, string, IS_STRING)
                                   ^~~~~~~~~~~~~~~~~~~~
/tmp/ext-src/trunk/php_bbcode.c:76:3: note: in expansion of macro 'convert_to_string_ex'
   convert_to_string_ex(&retval);
   ^~~~~~~~~~~~~~~~~~~~

/usr/local/include/php/Zend/zend_types.h:552:64: note: expected 'const zval *' {aka 'const struct _zval_struct *'} but argument is of type 'zval **' {aka 'struct _zval_struct **'}
 static zend_always_inline zend_uchar zval_get_type(const zval* pz) {
                                                    ~~~~~~~~~~~~^~

/usr/local/include/php/Zend/zend_types.h:562:39: warning: passing argument 1 of 'zval_get_type' from incompatible pointer type [-Wincompatible-pointer-types]
 #define Z_TYPE(zval)    zval_get_type(&(zval))
                                       ^~~~~~~
/usr/local/include/php/Zend/zend_types.h:563:28: note: in expansion of macro 'Z_TYPE'
 #define Z_TYPE_P(zval_p)   Z_TYPE(*(zval_p))
                            ^~~~~~
/usr/local/include/php/Zend/zend_operators.h:341:35: note: in expansion of macro 'Z_TYPE_P'
 #define convert_to_string(op) if (Z_TYPE_P(op) != IS_STRING) { _convert_to_string((op)); }
                                   ^~~~~~~~
/usr/local/include/php/Zend/zend_operators.h:449:3: note: in expansion of macro 'convert_to_string'
   convert_to_##lower_type(pzv);      \
   ^~~~~~~~~~~
/usr/local/include/php/Zend/zend_operators.h:496:35: note: in expansion of macro 'convert_to_ex_master'
 #define convert_to_string_ex(pzv) convert_to_ex_master(pzv, string, IS_STRING)
                                   ^~~~~~~~~~~~~~~~~~~~
/tmp/ext-src/trunk/php_bbcode.c:76:3: note: in expansion of macro 'convert_to_string_ex'
   convert_to_string_ex(&retval);
   ^~~~~~~~~~~~~~~~~~~~

/usr/local/include/php/Zend/zend_types.h:552:64: note: expected 'const zval *' {aka 'const struct _zval_struct *'} but argument is of type 'zval **' {aka 'struct _zval_struct **'}
 static zend_always_inline zend_uchar zval_get_type(const zval* pz) {
                                                    ~~~~~~~~~~~~^~

In file included from /usr/local/include/php/Zend/zend.h:357,
                 from /usr/local/include/php/main/php.h:31,
                 from /tmp/ext-src/trunk/php_bbcode.c:25:
/tmp/ext-src/trunk/php_bbcode.c:76:24: warning: passing argument 1 of '_convert_to_string' from incompatible pointer type [-Wincompatible-pointer-types]
   convert_to_string_ex(&retval);
/usr/local/include/php/Zend/zend_operators.h:341:84: note: in definition of macro 'convert_to_string'
 #define convert_to_string(op) if (Z_TYPE_P(op) != IS_STRING) { _convert_to_string((op)); }
                                                                                    ^~
/usr/local/include/php/Zend/zend_operators.h:496:35: note: in expansion of macro 'convert_to_ex_master'
 #define convert_to_string_ex(pzv) convert_to_ex_master(pzv, string, IS_STRING)
                                   ^~~~~~~~~~~~~~~~~~~~
/tmp/ext-src/trunk/php_bbcode.c:76:3: note: in expansion of macro 'convert_to_string_ex'
   convert_to_string_ex(&retval);
   ^~~~~~~~~~~~~~~~~~~~

/usr/local/include/php/Zend/zend_operators.h:262:54: note: expected 'zval *' {aka 'struct _zval_struct *'} but argument is of type 'zval **' {aka 'struct _zval_struct **'}
 ZEND_API void ZEND_FASTCALL _convert_to_string(zval *op);
                                                ~~~~~~^~

/tmp/ext-src/trunk/php_bbcode.c:82:17: warning: passing argument 1 of 'zval_ptr_dtor' from incompatible pointer type [-Wincompatible-pointer-types]
   zval_ptr_dtor(&retval);
                 ^~~~~~~

In file included from /usr/local/include/php/Zend/zend.h:36,
                 from /usr/local/include/php/main/php.h:31,
                 from /tmp/ext-src/trunk/php_bbcode.c:25:
/usr/local/include/php/Zend/zend_variables.h:79:35: note: expected 'zval *' {aka 'struct _zval_struct *'} but argument is of type 'zval **' {aka 'struct _zval_struct **'}
 ZEND_API void zval_ptr_dtor(zval *zval_ptr);
                             ~~~~~~^~~~~~~~

/tmp/ext-src/trunk/php_bbcode.c:87:22: warning: passing argument 1 of 'zval_ptr_dtor' from incompatible pointer type [-Wincompatible-pointer-types]
   zval_ptr_dtor(zargs[i]);
                 ~~~~~^~~

In file included from /usr/local/include/php/Zend/zend.h:36,
                 from /usr/local/include/php/main/php.h:31,
                 from /tmp/ext-src/trunk/php_bbcode.c:25:
/usr/local/include/php/Zend/zend_variables.h:79:35: note: expected 'zval *' {aka 'struct _zval_struct *'} but argument is of type 'zval **' {aka 'struct _zval_struct **'}
 ZEND_API void zval_ptr_dtor(zval *zval_ptr);
                             ~~~~~~^~~~~~~~

/tmp/ext-src/trunk/php_bbcode.c: At top level:

/tmp/ext-src/trunk/php_bbcode.c:112:109: error: expected ';', ',' or ')' before 'TSRMLS_DC'
 static void _php_bbcode_add_element(bbcode_parser_p parser, char *tag_name, int tag_name_len, zval *content TSRMLS_DC)
                                                                                                             ^~~~~~~~~

/tmp/ext-src/trunk/php_bbcode.c: In function 'php_bbcode_dtor':

/tmp/ext-src/trunk/php_bbcode.c:267:44: error: 'rsrc' undeclared (first use in this function)
  bbcode_parser_p parser = (bbcode_parser_p)rsrc->ptr;
                                            ^~~~

/tmp/ext-src/trunk/php_bbcode.c: In function 'zif_bbcode_create':

/tmp/ext-src/trunk/php_bbcode.c:381:44: error: expected ')' before 'TSRMLS_CC'
  if (zend_parse_parameters(ZEND_NUM_ARGS() TSRMLS_CC, "|a", &bbcode_entry) == FAILURE) {
                                            ^~~~~~~~~

/tmp/ext-src/trunk/php_bbcode.c:381:6: error: too few arguments to function 'zend_parse_parameters'
  if (zend_parse_parameters(ZEND_NUM_ARGS() TSRMLS_CC, "|a", &bbcode_entry) == FAILURE) {
      ^~~~~~~~~~~~~~~~~~~~~

In file included from /usr/local/include/php/main/php.h:35,
                 from /tmp/ext-src/trunk/php_bbcode.c:25:
/usr/local/include/php/Zend/zend_API.h:304:22: note: declared here
 ZEND_API zend_result zend_parse_parameters(uint32_t num_args, const char *type_spec, ...);
                      ^~~~~~~~~~~~~~~~~~~~~

/tmp/ext-src/trunk/php_bbcode.c:388:25: error: expected ')' before 'TSRMLS_CC'
   php_error_docref(NULL TSRMLS_CC, E_ERROR, "Unable to allocate memory for tag_stack");
                         ^~~~~~~~~

/tmp/ext-src/trunk/php_bbcode.c:388:3: error: too few arguments to function 'php_error_docref'
   php_error_docref(NULL TSRMLS_CC, E_ERROR, "Unable to allocate memory for tag_stack");
   ^~~~~~~~~~~~~~~~

In file included from /tmp/ext-src/trunk/php_bbcode.c:25:
/usr/local/include/php/main/php.h:341:23: note: declared here
 PHPAPI ZEND_COLD void php_error_docref(const char *docref, int type, const char *format, ...)
                       ^~~~~~~~~~~~~~~~

/tmp/ext-src/trunk/php_bbcode.c:413:44: warning: passing argument 2 of 'zend_hash_get_current_key_ex' from incompatible pointer type [-Wincompatible-pointer-types]
     i = zend_hash_get_current_key_ex(myht, &key, &key_len, &index, 0, &pos);
                                            ^~~~

In file included from /usr/local/include/php/Zend/zend.h:33,
                 from /usr/local/include/php/main/php.h:31,
                 from /tmp/ext-src/trunk/php_bbcode.c:25:
/usr/local/include/php/Zend/zend_hash.h:232:94: note: expected 'zend_string **' {aka 'struct _zend_string **'} but argument is of type 'char **'
 ZEND_API int   ZEND_FASTCALL zend_hash_get_current_key_ex(const HashTable *ht, zend_string **str_index, zend_ulong *num_index, HashPosition *pos);
                                                                                ~~~~~~~~~~~~~~^~~~~~~~~

/tmp/ext-src/trunk/php_bbcode.c:413:50: warning: passing argument 3 of 'zend_hash_get_current_key_ex' from incompatible pointer type [-Wincompatible-pointer-types]
     i = zend_hash_get_current_key_ex(myht, &key, &key_len, &index, 0, &pos);
                                                  ^~~~~~~~

In file included from /usr/local/include/php/Zend/zend.h:33,
                 from /usr/local/include/php/main/php.h:31,
                 from /tmp/ext-src/trunk/php_bbcode.c:25:
/usr/local/include/php/Zend/zend_hash.h:232:117: note: expected 'zend_ulong *' {aka 'long unsigned int *'} but argument is of type 'uint *' {aka 'unsigned int *'}
 ZEND_API int   ZEND_FASTCALL zend_hash_get_current_key_ex(const HashTable *ht, zend_string **str_index, zend_ulong *num_index, HashPosition *pos);
                                                                                                         ~~~~~~~~~~~~^~~~~~~~~

/tmp/ext-src/trunk/php_bbcode.c:413:60: warning: passing argument 4 of 'zend_hash_get_current_key_ex' from incompatible pointer type [-Wincompatible-pointer-types]
     i = zend_hash_get_current_key_ex(myht, &key, &key_len, &index, 0, &pos);
                                                            ^~~~~~

In file included from /usr/local/include/php/Zend/zend.h:33,
                 from /usr/local/include/php/main/php.h:31,
                 from /tmp/ext-src/trunk/php_bbcode.c:25:
/usr/local/include/php/Zend/zend_hash.h:232:142: note: expected 'HashPosition *' {aka 'unsigned int *'} but argument is of type 'ulong *' {aka 'long unsigned int *'}
 ZEND_API int   ZEND_FASTCALL zend_hash_get_current_key_ex(const HashTable *ht, zend_string **str_index, zend_ulong *num_index, HashPosition *pos);
                                                                                                                                ~~~~~~~~~~~~~~^~~

/tmp/ext-src/trunk/php_bbcode.c:413:9: error: too many arguments to function 'zend_hash_get_current_key_ex'
     i = zend_hash_get_current_key_ex(myht, &key, &key_len, &index, 0, &pos);
         ^~~~~~~~~~~~~~~~~~~~~~~~~~~~

In file included from /usr/local/include/php/Zend/zend.h:33,
                 from /usr/local/include/php/main/php.h:31,
                 from /tmp/ext-src/trunk/php_bbcode.c:25:
/usr/local/include/php/Zend/zend_hash.h:232:30: note: declared here
 ZEND_API int   ZEND_FASTCALL zend_hash_get_current_key_ex(const HashTable *ht, zend_string **str_index, zend_ulong *num_index, HashPosition *pos);
                              ^~~~~~~~~~~~~~~~~~~~~~~~~~~~

/tmp/ext-src/trunk/php_bbcode.c:414:14: error: 'HASH_KEY_NON_EXISTANT' undeclared (first use in this function); did you mean 'HASH_KEY_NON_EXISTENT'?
     if (i == HASH_KEY_NON_EXISTANT) {
              ^~~~~~~~~~~~~~~~~~~~~
              HASH_KEY_NON_EXISTENT

/tmp/ext-src/trunk/php_bbcode.c:418:45: warning: passing argument 2 of 'zend_hash_get_current_data_ex' from incompatible pointer type [-Wincompatible-pointer-types]
     if (zend_hash_get_current_data_ex(myht, (void **) &data, &pos) == SUCCESS) {
                                             ^~~~~~~~~~~~~~~

In file included from /usr/local/include/php/Zend/zend.h:33,
                 from /usr/local/include/php/main/php.h:31,
                 from /tmp/ext-src/trunk/php_bbcode.c:25:
/usr/local/include/php/Zend/zend_hash.h:235:30: note: expected 'HashPosition *' {aka 'unsigned int *'} but argument is of type 'void **'
 ZEND_API zval* ZEND_FASTCALL zend_hash_get_current_data_ex(HashTable *ht, HashPosition *pos);
                              ^~~~~~~~~~~~~~~~~~~~~~~~~~~~~

/tmp/ext-src/trunk/php_bbcode.c:418:9: error: too many arguments to function 'zend_hash_get_current_data_ex'
     if (zend_hash_get_current_data_ex(myht, (void **) &data, &pos) == SUCCESS) {
         ^~~~~~~~~~~~~~~~~~~~~~~~~~~~~

In file included from /usr/local/include/php/Zend/zend.h:33,
                 from /usr/local/include/php/main/php.h:31,
                 from /tmp/ext-src/trunk/php_bbcode.c:25:
/usr/local/include/php/Zend/zend_hash.h:235:30: note: declared here
 ZEND_API zval* ZEND_FASTCALL zend_hash_get_current_data_ex(HashTable *ht, HashPosition *pos);
                              ^~~~~~~~~~~~~~~~~~~~~~~~~~~~~

/tmp/ext-src/trunk/php_bbcode.c:421:13: error: 'HashTable' {aka 'struct _zend_array'} has no member named 'nApplyCount'
       tmp_ht->nApplyCount++;
             ^~

/tmp/ext-src/trunk/php_bbcode.c:425:7: warning: implicit declaration of function '_php_bbcode_add_element'; did you mean 'bbcode_array_element'? [-Wimplicit-function-declaration]
       _php_bbcode_add_element(parser, key, key_len - 1, *data TSRMLS_CC);
       ^~~~~~~~~~~~~~~~~~~~~~~
       bbcode_array_element

/tmp/ext-src/trunk/php_bbcode.c:425:62: error: expected ')' before 'TSRMLS_CC'
       _php_bbcode_add_element(parser, key, key_len - 1, *data TSRMLS_CC);
                                                              ^~~~~~~~~~
                                                              )

/tmp/ext-src/trunk/php_bbcode.c:428:14: error: 'HashTable' {aka 'struct _zend_array'} has no member named 'nApplyCount'
        tmp_ht->nApplyCount--;
              ^~

/tmp/ext-src/trunk/php_bbcode.c:436:2: warning: implicit declaration of function 'ZEND_REGISTER_RESOURCE'; did you mean 'ZEND_REF_FIRST_SOURCE'? [-Wimplicit-function-declaration]
  ZEND_REGISTER_RESOURCE(return_value, parser, le_bbcode);
  ^~~~~~~~~~~~~~~~~~~~~~
  ZEND_REF_FIRST_SOURCE

/tmp/ext-src/trunk/php_bbcode.c: In function 'zif_bbcode_add_element':

/tmp/ext-src/trunk/php_bbcode.c:468:44: error: expected ')' before 'TSRMLS_CC'
  if (zend_parse_parameters(ZEND_NUM_ARGS() TSRMLS_CC, "rsa", &z_bbcode_parser, &tag_name, &tag_name_len, &bbcode_entry) == FAILURE) {
                                            ^~~~~~~~~

/tmp/ext-src/trunk/php_bbcode.c:468:6: error: too few arguments to function 'zend_parse_parameters'
  if (zend_parse_parameters(ZEND_NUM_ARGS() TSRMLS_CC, "rsa", &z_bbcode_parser, &tag_name, &tag_name_len, &bbcode_entry) == FAILURE) {
      ^~~~~~~~~~~~~~~~~~~~~

In file included from /usr/local/include/php/main/php.h:35,
                 from /tmp/ext-src/trunk/php_bbcode.c:25:
/usr/local/include/php/Zend/zend_API.h:304:22: note: declared here
 ZEND_API zend_result zend_parse_parameters(uint32_t num_args, const char *type_spec, ...);
                      ^~~~~~~~~~~~~~~~~~~~~

/tmp/ext-src/trunk/php_bbcode.c:472:2: warning: implicit declaration of function 'ZEND_FETCH_RESOURCE'; did you mean 'ZEND_FETCH_LIST_R'? [-Wimplicit-function-declaration]
  ZEND_FETCH_RESOURCE(parser, bbcode_parser_p, &z_bbcode_parser, -1, PHP_BBCODE_RES_NAME, le_bbcode);
  ^~~~~~~~~~~~~~~~~~~
  ZEND_FETCH_LIST_R

/tmp/ext-src/trunk/php_bbcode.c:472:30: error: expected expression before 'bbcode_parser_p'
  ZEND_FETCH_RESOURCE(parser, bbcode_parser_p, &z_bbcode_parser, -1, PHP_BBCODE_RES_NAME, le_bbcode);
                              ^~~~~~~~~~~~~~~

/tmp/ext-src/trunk/php_bbcode.c:473:70: error: expected ')' before 'TSRMLS_CC'
  _php_bbcode_add_element(parser, tag_name, tag_name_len, bbcode_entry TSRMLS_CC);
                                                                      ^~~~~~~~~~
                                                                      )

/tmp/ext-src/trunk/php_bbcode.c: In function 'zif_bbcode_destroy':

/tmp/ext-src/trunk/php_bbcode.c:484:44: error: expected ')' before 'TSRMLS_CC'
  if (zend_parse_parameters(ZEND_NUM_ARGS() TSRMLS_CC, "r", &z_bbcode_parser) == FAILURE) {
                                            ^~~~~~~~~

/tmp/ext-src/trunk/php_bbcode.c:484:6: error: too few arguments to function 'zend_parse_parameters'
  if (zend_parse_parameters(ZEND_NUM_ARGS() TSRMLS_CC, "r", &z_bbcode_parser) == FAILURE) {
      ^~~~~~~~~~~~~~~~~~~~~

In file included from /usr/local/include/php/main/php.h:35,
                 from /tmp/ext-src/trunk/php_bbcode.c:25:
/usr/local/include/php/Zend/zend_API.h:304:22: note: declared here
 ZEND_API zend_result zend_parse_parameters(uint32_t num_args, const char *type_spec, ...);
                      ^~~~~~~~~~~~~~~~~~~~~

In file included from /usr/local/include/php/Zend/zend.h:27,
                 from /usr/local/include/php/main/php.h:31,
                 from /tmp/ext-src/trunk/php_bbcode.c:25:
/usr/local/include/php/Zend/zend_types.h:795:37: warning: passing argument 1 of 'zend_list_delete' makes pointer from integer without a cast [-Wint-conversion]
 #define Z_LVAL(zval)    (zval).value.lval
                         ~~~~~~~~~~~~^~~~~
/usr/local/include/php/Zend/zend_types.h:893:5: note: in definition of macro 'ZVAL_BOOL'
    (b) ? IS_TRUE : IS_FALSE; \
     ^
/usr/local/include/php/Zend/zend_API.h:734:33: note: in expansion of macro 'RETVAL_BOOL'
 #define RETURN_BOOL(b)     do { RETVAL_BOOL(b); return; } while (0)
                                 ^~~~~~~~~~~
/tmp/ext-src/trunk/php_bbcode.c:488:2: note: in expansion of macro 'RETURN_BOOL'
  RETURN_BOOL(zend_list_delete(Z_LVAL_P(z_bbcode_parser)) == SUCCESS);
  ^~~~~~~~~~~
/usr/local/include/php/Zend/zend_types.h:796:28: note: in expansion of macro 'Z_LVAL'
 #define Z_LVAL_P(zval_p)   Z_LVAL(*(zval_p))
                            ^~~~~~
/tmp/ext-src/trunk/php_bbcode.c:488:31: note: in expansion of macro 'Z_LVAL_P'
  RETURN_BOOL(zend_list_delete(Z_LVAL_P(z_bbcode_parser)) == SUCCESS);
                               ^~~~~~~~

In file included from /usr/local/include/php/Zend/zend_API.h:26,
                 from /usr/local/include/php/main/php.h:35,
                 from /tmp/ext-src/trunk/php_bbcode.c:25:
/usr/local/include/php/Zend/zend_list.h:57:60: note: expected 'zend_resource *' {aka 'struct _zend_resource *'} but argument is of type 'zend_long' {aka 'long int'}
 ZEND_API int ZEND_FASTCALL zend_list_delete(zend_resource *res);
                                             ~~~~~~~~~~~~~~~^~~

/tmp/ext-src/trunk/php_bbcode.c: In function 'zif_bbcode_parse':

/tmp/ext-src/trunk/php_bbcode.c:503:44: error: expected ')' before 'TSRMLS_CC'
  if (zend_parse_parameters(ZEND_NUM_ARGS() TSRMLS_CC, "rs", &z_bbcode_parser, &string, &str_len) == FAILURE) {
                                            ^~~~~~~~~

/tmp/ext-src/trunk/php_bbcode.c:503:6: error: too few arguments to function 'zend_parse_parameters'
  if (zend_parse_parameters(ZEND_NUM_ARGS() TSRMLS_CC, "rs", &z_bbcode_parser, &string, &str_len) == FAILURE) {
      ^~~~~~~~~~~~~~~~~~~~~

In file included from /usr/local/include/php/main/php.h:35,
                 from /tmp/ext-src/trunk/php_bbcode.c:25:
/usr/local/include/php/Zend/zend_API.h:304:22: note: declared here
 ZEND_API zend_result zend_parse_parameters(uint32_t num_args, const char *type_spec, ...);
                      ^~~~~~~~~~~~~~~~~~~~~

/tmp/ext-src/trunk/php_bbcode.c:507:30: error: expected expression before 'bbcode_parser_p'
  ZEND_FETCH_RESOURCE(parser, bbcode_parser_p, &z_bbcode_parser, -1, PHP_BBCODE_RES_NAME, le_bbcode);
                              ^~~~~~~~~~~~~~~

/tmp/ext-src/trunk/php_bbcode.c:512:41: error: macro "RETVAL_STRINGL" passed 3 arguments, but takes just 2
  RETVAL_STRINGL(ret_string, ret_size , 1);
                                         ^

/tmp/ext-src/trunk/php_bbcode.c:512:2: error: 'RETVAL_STRINGL' undeclared (first use in this function)
  RETVAL_STRINGL(ret_string, ret_size , 1);
  ^~~~~~~~~~~~~~

/tmp/ext-src/trunk/php_bbcode.c: In function 'zif_bbcode_add_smiley':

/tmp/ext-src/trunk/php_bbcode.c:526:44: error: expected ')' before 'TSRMLS_CC'
  if (zend_parse_parameters(ZEND_NUM_ARGS() TSRMLS_CC, "rss", &z_bbcode_parser, &search, &s_len, &replace, &r_len) == FAILURE) {
                                            ^~~~~~~~~

/tmp/ext-src/trunk/php_bbcode.c:526:6: error: too few arguments to function 'zend_parse_parameters'
  if (zend_parse_parameters(ZEND_NUM_ARGS() TSRMLS_CC, "rss", &z_bbcode_parser, &search, &s_len, &replace, &r_len) == FAILURE) {
      ^~~~~~~~~~~~~~~~~~~~~

In file included from /usr/local/include/php/main/php.h:35,
                 from /tmp/ext-src/trunk/php_bbcode.c:25:
/usr/local/include/php/Zend/zend_API.h:304:22: note: declared here
 ZEND_API zend_result zend_parse_parameters(uint32_t num_args, const char *type_spec, ...);
                      ^~~~~~~~~~~~~~~~~~~~~

/tmp/ext-src/trunk/php_bbcode.c:530:30: error: expected expression before 'bbcode_parser_p'
  ZEND_FETCH_RESOURCE(parser, bbcode_parser_p, &z_bbcode_parser, -1, PHP_BBCODE_RES_NAME, le_bbcode);
                              ^~~~~~~~~~~~~~~

/tmp/ext-src/trunk/php_bbcode.c: In function 'zif_bbcode_set_flags':

/tmp/ext-src/trunk/php_bbcode.c:547:44: error: expected ')' before 'TSRMLS_CC'
  if (zend_parse_parameters(ZEND_NUM_ARGS() TSRMLS_CC, "rl|l", &z_bbcode_parser, &new_flags, &mode) == FAILURE) {
                                            ^~~~~~~~~

/tmp/ext-src/trunk/php_bbcode.c:547:6: error: too few arguments to function 'zend_parse_parameters'
  if (zend_parse_parameters(ZEND_NUM_ARGS() TSRMLS_CC, "rl|l", &z_bbcode_parser, &new_flags, &mode) == FAILURE) {
      ^~~~~~~~~~~~~~~~~~~~~

In file included from /usr/local/include/php/main/php.h:35,
                 from /tmp/ext-src/trunk/php_bbcode.c:25:
/usr/local/include/php/Zend/zend_API.h:304:22: note: declared here
 ZEND_API zend_result zend_parse_parameters(uint32_t num_args, const char *type_spec, ...);
                      ^~~~~~~~~~~~~~~~~~~~~

/tmp/ext-src/trunk/php_bbcode.c:551:30: error: expected expression before 'bbcode_parser_p'
  ZEND_FETCH_RESOURCE(parser, bbcode_parser_p, &z_bbcode_parser, -1, PHP_BBCODE_RES_NAME, le_bbcode);
                              ^~~~~~~~~~~~~~~

/tmp/ext-src/trunk/php_bbcode.c: In function 'zif_bbcode_set_arg_parser':

/tmp/ext-src/trunk/php_bbcode.c:583:44: error: expected ')' before 'TSRMLS_CC'
  if (zend_parse_parameters(ZEND_NUM_ARGS() TSRMLS_CC, "rr", &z_bbcode_parser, &z_bbcode_parser_child) == FAILURE) {
                                            ^~~~~~~~~

/tmp/ext-src/trunk/php_bbcode.c:583:6: error: too few arguments to function 'zend_parse_parameters'
  if (zend_parse_parameters(ZEND_NUM_ARGS() TSRMLS_CC, "rr", &z_bbcode_parser, &z_bbcode_parser_child) == FAILURE) {
      ^~~~~~~~~~~~~~~~~~~~~

In file included from /usr/local/include/php/main/php.h:35,
                 from /tmp/ext-src/trunk/php_bbcode.c:25:
/usr/local/include/php/Zend/zend_API.h:304:22: note: declared here
 ZEND_API zend_result zend_parse_parameters(uint32_t num_args, const char *type_spec, ...);
                      ^~~~~~~~~~~~~~~~~~~~~

/tmp/ext-src/trunk/php_bbcode.c:587:30: error: expected expression before 'bbcode_parser_p'
  ZEND_FETCH_RESOURCE(parser, bbcode_parser_p, &z_bbcode_parser, -1, PHP_BBCODE_RES_NAME, le_bbcode);
                              ^~~~~~~~~~~~~~~

/tmp/ext-src/trunk/php_bbcode.c:588:34: error: expected expression before 'bbcode_parser_p'
  ZEND_FETCH_RESOURCE(arg_parser, bbcode_parser_p, &z_bbcode_parser_child, -1, PHP_BBCODE_RES_NAME, le_bbcode);
                                  ^~~~~~~~~~~~~~~

make: *** [Makefile:208: php_bbcode.lo] Error 1