php-ext.com / gmagick (from dev using PHP 7.4.16-buster)

Dockerfile
FROM php:7.4.16-buster
WORKDIR /tmp
RUN apt update && \
    apt install -y --no-install-recommends git subversion autoconf build-essential && \
    apt install -y --no-install-recommends graphicsmagick libgraphicsmagick1-dev && \
    rm -rf /var/lib/apt/lists/*
RUN svn checkout --revision HEAD https://svn.php.net/repository/pecl/gmagick /tmp/ext-src && \
    cd /tmp/ext-src/trunk && \
    phpize && \
    ./configure --with-gmagick && \
    make && \
    make test
Build output FAIL 33ss
Step 1/4 : FROM php:7.4.16-buster
---> 5f58d719d4ac
Step 2/4 : WORKDIR /tmp
---> Running in d9fd0211df00
Removing intermediate container d9fd0211df00
---> c449a8e38567
Step 3/4 : RUN apt update && apt install -y --no-install-recommends git subversion autoconf build-essential && apt install -y --no-install-recommends graphicsmagick libgraphicsmagick1-dev && rm -rf /var/lib/apt/lists/*
---> Running in a1cba0c20fcc


WARNING: 
apt does not have a stable CLI interface. Use with caution in scripts.


Get:1 http://security.debian.org/debian-security buster/updates InRelease [65.4 kB]
Get:2 http://deb.debian.org/debian buster InRelease [122 kB]
Get:3 http://deb.debian.org/debian buster-updates InRelease [51.9 kB]
Get:4 http://security.debian.org/debian-security buster/updates/main amd64 Packages [268 kB]
Get:5 http://deb.debian.org/debian buster/main amd64 Packages [7907 kB]
Get:6 http://deb.debian.org/debian buster-updates/main amd64 Packages [9504 B]
Fetched 8423 kB in 1s (5732 kB/s)
Reading package lists...
Building dependency tree...
Reading state information...
1 package can be upgraded. Run 'apt list --upgradable' to see it.


WARNING: 
apt
 
does not have a stable CLI interface. 
Use with caution in scripts.




Reading package lists...
Building dependency tree...
Reading state information...
autoconf is already the newest version (2.69-11).
The following package was automatically installed and is no longer required:
lsb-base
Use 'apt autoremove' to remove it.
The following additional packages will be installed:
git-man libapr1 libaprutil1 libcurl3-gnutls liberror-perl libexpat1
libpcre2-8-0 libserf-1-1 libsvn1 libutf8proc2
Suggested packages:
gettext-base git-daemon-run | git-daemon-sysvinit git-doc git-el git-email
git-gui gitk gitweb git-cvs git-mediawiki git-svn db5.3-util
libapache2-mod-svn subversion-tools
Recommended packages:
less ssh-client
The following NEW packages will be installed:
build-essential git git-man libapr1 libaprutil1 libcurl3-gnutls
liberror-perl libexpat1 libpcre2-8-0 libserf-1-1 libsvn1 libutf8proc2
subversion
0 upgraded, 13 newly installed, 0 to remove and 1 not upgraded.
Need to get 10.7 MB of archives.
After this operation, 50.2 MB of additional disk space will be used.
Get:1 http://security.debian.org/debian-security buster/updates/main amd64 libsvn1 amd64 1.10.4-1+deb10u2 [1403 kB]
Get:2 http://deb.debian.org/debian buster/main amd64 build-essential amd64 12.6 [7576 B]
Get:3 http://deb.debian.org/debian buster/main amd64 libcurl3-gnutls amd64 7.64.0-4+deb10u1 [330 kB]
Get:4 http://deb.debian.org/debian buster/main amd64 libexpat1 amd64 2.2.6-2+deb10u1 [106 kB]
Get:5 http://deb.debian.org/debian buster/main amd64 libpcre2-8-0 amd64 10.32-5 [213 kB]
Get:6 http://deb.debian.org/debian buster/main amd64 liberror-perl all 0.17027-2 [30.9 kB]
Get:7 http://deb.debian.org/debian buster/main amd64 git-man all 1:2.20.1-2+deb10u3 [1620 kB]
Get:8 http://security.debian.org/debian-security buster/updates/main amd64 subversion amd64 1.10.4-1+deb10u2 [1008 kB]
Get:9 http://deb.debian.org/debian buster/main amd64 git amd64 1:2.20.1-2+deb10u3 [5633 kB]
Get:10 http://deb.debian.org/debian buster/main amd64 libapr1 amd64 1.6.5-1+b1 [102 kB]
Get:11 http://deb.debian.org/debian buster/main amd64 libaprutil1 amd64 1.6.1-4 [91.8 kB]
Get:12 http://deb.debian.org/debian buster/main amd64 libserf-1-1 amd64 1.3.9-7+b10 [53.6 kB]
Get:13 http://deb.debian.org/debian buster/main amd64 libutf8proc2 amd64 2.3.0-1 [53.0 kB]
debconf: delaying package configuration, since apt-utils is not installed

Fetched 10.7 MB in 0s (84.3 MB/s)
Selecting previously unselected package build-essential.
(Reading database ...
(Reading database ... 5%
(Reading database ... 10%
(Reading database ... 15%
(Reading database ... 20%
(Reading database ... 25%
(Reading database ... 30%
(Reading database ... 35%
(Reading database ... 40%
(Reading database ... 45%
(Reading database ... 50%
(Reading database ... 55%
(Reading database ... 60%
(Reading database ... 65%
(Reading database ... 70%
(Reading database ... 75%
(Reading database ... 80%
(Reading database ... 85%
(Reading database ... 90%
(Reading database ... 95%
(Reading database ... 100%
(Reading database ...
12690 files and directories currently installed.)
Preparing to unpack .../00-build-essential_12.6_amd64.deb ...
Unpacking build-essential (12.6) ...
Selecting previously unselected package libcurl3-gnutls:amd64.
Preparing to unpack .../01-libcurl3-gnutls_7.64.0-4+deb10u1_amd64.deb ...
Unpacking libcurl3-gnutls:amd64 (7.64.0-4+deb10u1) ...
Selecting previously unselected package libexpat1:amd64.
Preparing to unpack .../02-libexpat1_2.2.6-2+deb10u1_amd64.deb ...
Unpacking libexpat1:amd64 (2.2.6-2+deb10u1) ...
Selecting previously unselected package libpcre2-8-0:amd64.
Preparing to unpack .../03-libpcre2-8-0_10.32-5_amd64.deb ...
Unpacking libpcre2-8-0:amd64 (10.32-5) ...
Selecting previously unselected package liberror-perl.
Preparing to unpack .../04-liberror-perl_0.17027-2_all.deb ...
Unpacking liberror-perl (0.17027-2) ...
Selecting previously unselected package git-man.
Preparing to unpack .../05-git-man_1%3a2.20.1-2+deb10u3_all.deb ...
Unpacking git-man (1:2.20.1-2+deb10u3) ...
Selecting previously unselected package git.
Preparing to unpack .../06-git_1%3a2.20.1-2+deb10u3_amd64.deb ...
Unpacking git (1:2.20.1-2+deb10u3) ...
Selecting previously unselected package libapr1:amd64.
Preparing to unpack .../07-libapr1_1.6.5-1+b1_amd64.deb ...
Unpacking libapr1:amd64 (1.6.5-1+b1) ...
Selecting previously unselected package libaprutil1:amd64.
Preparing to unpack .../08-libaprutil1_1.6.1-4_amd64.deb ...
Unpacking libaprutil1:amd64 (1.6.1-4) ...
Selecting previously unselected package libserf-1-1:amd64.
Preparing to unpack .../09-libserf-1-1_1.3.9-7+b10_amd64.deb ...
Unpacking libserf-1-1:amd64 (1.3.9-7+b10) ...
Selecting previously unselected package libutf8proc2:amd64.
Preparing to unpack .../10-libutf8proc2_2.3.0-1_amd64.deb ...
Unpacking libutf8proc2:amd64 (2.3.0-1) ...
Selecting previously unselected package libsvn1:amd64.
Preparing to unpack .../11-libsvn1_1.10.4-1+deb10u2_amd64.deb ...
Unpacking libsvn1:amd64 (1.10.4-1+deb10u2) ...
Selecting previously unselected package subversion.
Preparing to unpack .../12-subversion_1.10.4-1+deb10u2_amd64.deb ...
Unpacking subversion (1.10.4-1+deb10u2) ...
Setting up libexpat1:amd64 (2.2.6-2+deb10u1) ...
Setting up libutf8proc2:amd64 (2.3.0-1) ...
Setting up libapr1:amd64 (1.6.5-1+b1) ...
Setting up libcurl3-gnutls:amd64 (7.64.0-4+deb10u1) ...
Setting up liberror-perl (0.17027-2) ...
Setting up libpcre2-8-0:amd64 (10.32-5) ...
Setting up build-essential (12.6) ...
Setting up git-man (1:2.20.1-2+deb10u3) ...
Setting up libaprutil1:amd64 (1.6.1-4) ...
Setting up libserf-1-1:amd64 (1.3.9-7+b10) ...
Setting up git (1:2.20.1-2+deb10u3) ...
Setting up libsvn1:amd64 (1.10.4-1+deb10u2) ...
Setting up subversion (1.10.4-1+deb10u2) ...
Processing triggers for libc-bin (2.28-10) ...


WARNING: 
apt
 
does not have a stable CLI interface. 
Use with caution in scripts.




Reading package lists...
Building dependency tree...
Reading state information...
The following additional packages will be installed:
automake autotools-dev icu-devtools libbz2-dev libexif-dev libexif12
libfreetype6 libfreetype6-dev libgraphicsmagick-q16-3 libice-dev libice6
libicu-dev libjbig-dev libjbig0 libjpeg-dev libjpeg62-turbo
libjpeg62-turbo-dev liblcms2-2 liblcms2-dev libltdl-dev libltdl7 liblzma-dev
libpng-dev libpng16-16 libpthread-stubs0-dev libsm-dev libsm6 libtiff-dev
libtiff5 libtiffxx5 libwebp-dev libwebp6 libwebpdemux2 libwebpmux3
libwmf-dev libwmf0.2-7 libx11-6 libx11-data libx11-dev libxau-dev libxau6
libxcb1 libxcb1-dev libxdmcp-dev libxdmcp6 libxext-dev libxext6 libxml2-dev
libzstd-dev libzstd1 x11-common x11proto-core-dev x11proto-dev
x11proto-xext-dev xorg-sgml-doctools xtrans-dev zlib1g-dev
Suggested packages:
autoconf-doc gnu-standards graphicsmagick-dbg freetype2-doc libice-doc
icu-doc liblcms2-utils libtool-doc liblzma-doc libsm-doc libwmf-doc
libwmf0.2-7-gtk libx11-doc libxcb-doc libxext-doc
Recommended packages:
bzip2-doc libexif-doc ghostscript gsfonts libtool libpng-tools
The following NEW packages will be installed:
automake autotools-dev graphicsmagick icu-devtools libbz2-dev libexif-dev
libexif12 libfreetype6 libfreetype6-dev libgraphicsmagick-q16-3
libgraphicsmagick1-dev libice-dev libice6 libicu-dev libjbig-dev libjbig0
libjpeg-dev libjpeg62-turbo libjpeg62-turbo-dev liblcms2-2 liblcms2-dev
libltdl-dev libltdl7 liblzma-dev libpng-dev libpng16-16
libpthread-stubs0-dev libsm-dev libsm6 libtiff-dev libtiff5 libtiffxx5
libwebp-dev libwebp6 libwebpdemux2 libwebpmux3 libwmf-dev libwmf0.2-7
libx11-6 libx11-data libx11-dev libxau-dev libxau6 libxcb1 libxcb1-dev
libxdmcp-dev libxdmcp6 libxext-dev libxext6 libxml2-dev libzstd-dev
x11-common x11proto-core-dev x11proto-dev x11proto-xext-dev
xorg-sgml-doctools xtrans-dev zlib1g-dev
The following packages will be upgraded:
libzstd1
1 upgraded, 58 newly installed, 0 to remove and 0 not upgraded.
Need to get 33.0 MB of archives.
After this operation, 102 MB of additional disk space will be used.
Get:1 http://security.debian.org/debian-security buster/updates/main amd64 libzstd1 amd64 1.3.8+dfsg-3+deb10u2 [237 kB]
Get:2 http://deb.debian.org/debian buster/main amd64 autotools-dev all 20180224.1 [77.0 kB]
Get:3 http://deb.debian.org/debian buster/main amd64 automake all 1:1.16.1-4 [771 kB]
Get:4 http://security.debian.org/debian-security buster/updates/main amd64 libzstd-dev amd64 1.3.8+dfsg-3+deb10u2 [285 kB]
Get:5 http://deb.debian.org/debian buster/main amd64 libjbig0 amd64 2.1-3.1+b2 [31.0 kB]
Get:6 http://deb.debian.org/debian buster/main amd64 libjpeg62-turbo amd64 1:1.5.2-2+deb10u1 [133 kB]
Get:7 http://deb.debian.org/debian buster/main amd64 libwebp6 amd64 0.6.1-2 [263 kB]
Get:8 http://deb.debian.org/debian buster/main amd64 libtiff5 amd64 4.1.0+git191117-2~deb10u1 [271 kB]
Get:9 http://deb.debian.org/debian buster/main amd64 libpng16-16 amd64 1.6.36-6 [292 kB]
Get:10 http://deb.debian.org/debian buster/main amd64 libfreetype6 amd64 2.9.1-3+deb10u2 [380 kB]
Get:11 http://deb.debian.org/debian buster/main amd64 x11-common all 1:7.7+19 [251 kB]
Get:12 http://deb.debian.org/debian buster/main amd64 libice6 amd64 2:1.0.9-2 [58.7 kB]
Get:13 http://deb.debian.org/debian buster/main amd64 liblcms2-2 amd64 2.9-3 [145 kB]
Get:14 http://deb.debian.org/debian buster/main amd64 libsm6 amd64 2:1.2.3-1 [35.1 kB]
Get:15 http://deb.debian.org/debian buster/main amd64 libwebpmux3 amd64 0.6.1-2 [97.7 kB]
Get:16 http://deb.debian.org/debian buster/main amd64 libxau6 amd64 1:1.0.8-1+b2 [19.9 kB]
Get:17 http://deb.debian.org/debian buster/main amd64 libxdmcp6 amd64 1:1.1.2-3 [26.3 kB]
Get:18 http://deb.debian.org/debian buster/main amd64 libxcb1 amd64 1.13.1-2 [137 kB]
Get:19 http://deb.debian.org/debian buster/main amd64 libx11-data all 2:1.6.7-1+deb10u1 [294 kB]
Get:20 http://deb.debian.org/debian buster/main amd64 libx11-6 amd64 2:1.6.7-1+deb10u1 [757 kB]
Get:21 http://deb.debian.org/debian buster/main amd64 libwmf0.2-7 amd64 0.2.8.4-14 [166 kB]
Get:22 http://deb.debian.org/debian buster/main amd64 libxext6 amd64 2:1.3.3-1+b2 [52.5 kB]
Get:23 http://deb.debian.org/debian buster/main amd64 libgraphicsmagick-q16-3 amd64 1.4+really1.3.35-1~deb10u1 [1160 kB]
Get:24 http://deb.debian.org/debian buster/main amd64 graphicsmagick amd64 1.4+really1.3.35-1~deb10u1 [982 kB]
Get:25 http://deb.debian.org/debian buster/main amd64 icu-devtools amd64 63.1-6+deb10u1 [189 kB]
Get:26 http://deb.debian.org/debian buster/main amd64 libbz2-dev amd64 1.0.6-9.2~deb10u1 [30.2 kB]
Get:27 http://deb.debian.org/debian buster/main amd64 libexif12 amd64 0.6.21-5.1+deb10u5 [326 kB]
Get:28 http://deb.debian.org/debian buster/main amd64 libexif-dev amd64 0.6.21-5.1+deb10u5 [113 kB]
Get:29 http://deb.debian.org/debian buster/main amd64 zlib1g-dev amd64 1:1.2.11.dfsg-1 [214 kB]
Get:30 http://deb.debian.org/debian buster/main amd64 libpng-dev amd64 1.6.36-6 [300 kB]
Get:31 http://deb.debian.org/debian buster/main amd64 libfreetype6-dev amd64 2.9.1-3+deb10u2 [544 kB]
Get:32 http://deb.debian.org/debian buster/main amd64 libjpeg62-turbo-dev amd64 1:1.5.2-2+deb10u1 [208 kB]
Get:33 http://deb.debian.org/debian buster/main amd64 libjpeg-dev all 1:1.5.2-2+deb10u1 [57.7 kB]
Get:34 http://deb.debian.org/debian buster/main amd64 liblcms2-dev amd64 2.9-3 [9102 kB]
Get:35 http://deb.debian.org/debian buster/main amd64 xorg-sgml-doctools all 1:1.11-1 [21.9 kB]
Get:36 http://deb.debian.org/debian buster/main amd64 x11proto-dev all 2018.4-4 [251 kB]
Get:37 http://deb.debian.org/debian buster/main amd64 x11proto-core-dev all 2018.4-4 [3128 B]
Get:38 http://deb.debian.org/debian buster/main amd64 libxau-dev amd64 1:1.0.8-1+b2 [23.1 kB]
Get:39 http://deb.debian.org/debian buster/main amd64 libxdmcp-dev amd64 1:1.1.2-3 [42.2 kB]
Get:40 http://deb.debian.org/debian buster/main amd64 xtrans-dev all 1.3.5-1 [100 kB]
Get:41 http://deb.debian.org/debian buster/main amd64 libpthread-stubs0-dev amd64 0.4-1 [5344 B]
Get:42 http://deb.debian.org/debian buster/main amd64 libxcb1-dev amd64 1.13.1-2 [174 kB]
Get:43 http://deb.debian.org/debian buster/main amd64 libx11-dev amd64 2:1.6.7-1+deb10u1 [824 kB]
Get:44 http://deb.debian.org/debian buster/main amd64 libwmf-dev amd64 0.2.8.4-14 [190 kB]
Get:45 http://deb.debian.org/debian buster/main amd64 libice-dev amd64 2:1.0.9-2 [66.8 kB]
Get:46 http://deb.debian.org/debian buster/main amd64 libsm-dev amd64 2:1.2.3-1 [38.0 kB]
Get:47 http://deb.debian.org/debian buster/main amd64 x11proto-xext-dev all 2018.4-4 [3128 B]
Get:48 http://deb.debian.org/debian buster/main amd64 libxext-dev amd64 2:1.3.3-1+b2 [107 kB]
Get:49 http://deb.debian.org/debian buster/main amd64 libicu-dev amd64 63.1-6+deb10u1 [9186 kB]
Get:50 http://deb.debian.org/debian buster/main amd64 libxml2-dev amd64 2.9.4+dfsg1-7+deb10u1 [784 kB]
Get:51 http://deb.debian.org/debian buster/main amd64 libjbig-dev amd64 2.1-3.1+b2 [30.5 kB]
Get:52 http://deb.debian.org/debian buster/main amd64 liblzma-dev amd64 5.2.4-1 [210 kB]
Get:53 http://deb.debian.org/debian buster/main amd64 libtiffxx5 amd64 4.1.0+git191117-2~deb10u1 [117 kB]
Get:54 http://deb.debian.org/debian buster/main amd64 libtiff-dev amd64 4.1.0+git191117-2~deb10u1 [394 kB]
Get:55 http://deb.debian.org/debian buster/main amd64 libltdl7 amd64 2.4.6-9 [390 kB]
Get:56 http://deb.debian.org/debian buster/main amd64 libltdl-dev amd64 2.4.6-9 [162 kB]
Get:57 http://deb.debian.org/debian buster/main amd64 libwebpdemux2 amd64 0.6.1-2 [87.5 kB]
Get:58 http://deb.debian.org/debian buster/main amd64 libwebp-dev amd64 0.6.1-2 [345 kB]
Get:59 http://deb.debian.org/debian buster/main amd64 libgraphicsmagick1-dev amd64 1.4+really1.3.35-1~deb10u1 [1399 kB]
debconf: delaying package configuration, since apt-utils is not installed

Fetched 33.0 MB in 0s (84.9 MB/s)
(Reading database ...
(Reading database ... 5%
(Reading database ... 10%
(Reading database ... 15%
(Reading database ... 20%
(Reading database ... 25%
(Reading database ... 30%
(Reading database ... 35%
(Reading database ... 40%
(Reading database ... 45%
(Reading database ... 50%
(Reading database ... 55%
(Reading database ... 60%
(Reading database ... 65%
(Reading database ... 70%
(Reading database ... 75%
(Reading database ... 80%
(Reading database ... 85%
(Reading database ... 90%
(Reading database ... 95%
(Reading database ... 100%
(Reading database ...
13812 files and directories currently installed.)
Preparing to unpack .../libzstd1_1.3.8+dfsg-3+deb10u2_amd64.deb ...
Unpacking libzstd1:amd64 (1.3.8+dfsg-3+deb10u2) over (1.3.8+dfsg-3) ...
Setting up libzstd1:amd64 (1.3.8+dfsg-3+deb10u2) ...
Selecting previously unselected package autotools-dev.
(Reading database ...
(Reading database ... 5%
(Reading database ... 10%
(Reading database ... 15%
(Reading database ... 20%
(Reading database ... 25%
(Reading database ... 30%
(Reading database ... 35%
(Reading database ... 40%
(Reading database ... 45%
(Reading database ... 50%
(Reading database ... 55%
(Reading database ... 60%
(Reading database ... 65%
(Reading database ... 70%
(Reading database ... 75%
(Reading database ... 80%
(Reading database ... 85%
(Reading database ... 90%
(Reading database ... 95%
(Reading database ... 100%
(Reading database ...
13812 files and directories currently installed.)
Preparing to unpack .../00-autotools-dev_20180224.1_all.deb ...
Unpacking autotools-dev (20180224.1) ...
Selecting previously unselected package automake.
Preparing to unpack .../01-automake_1%3a1.16.1-4_all.deb ...
Unpacking automake (1:1.16.1-4) ...
Selecting previously unselected package libjbig0:amd64.
Preparing to unpack .../02-libjbig0_2.1-3.1+b2_amd64.deb ...
Unpacking libjbig0:amd64 (2.1-3.1+b2) ...
Selecting previously unselected package libjpeg62-turbo:amd64.
Preparing to unpack .../03-libjpeg62-turbo_1%3a1.5.2-2+deb10u1_amd64.deb ...
Unpacking libjpeg62-turbo:amd64 (1:1.5.2-2+deb10u1) ...
Selecting previously unselected package libwebp6:amd64.
Preparing to unpack .../04-libwebp6_0.6.1-2_amd64.deb ...
Unpacking libwebp6:amd64 (0.6.1-2) ...
Selecting previously unselected package libtiff5:amd64.
Preparing to unpack .../05-libtiff5_4.1.0+git191117-2~deb10u1_amd64.deb ...
Unpacking libtiff5:amd64 (4.1.0+git191117-2~deb10u1) ...
Selecting previously unselected package libpng16-16:amd64.
Preparing to unpack .../06-libpng16-16_1.6.36-6_amd64.deb ...
Unpacking libpng16-16:amd64 (1.6.36-6) ...
Selecting previously unselected package libfreetype6:amd64.
Preparing to unpack .../07-libfreetype6_2.9.1-3+deb10u2_amd64.deb ...
Unpacking libfreetype6:amd64 (2.9.1-3+deb10u2) ...
Selecting previously unselected package x11-common.
Preparing to unpack .../08-x11-common_1%3a7.7+19_all.deb ...
Unpacking x11-common (1:7.7+19) ...
Selecting previously unselected package libice6:amd64.
Preparing to unpack .../09-libice6_2%3a1.0.9-2_amd64.deb ...
Unpacking libice6:amd64 (2:1.0.9-2) ...
Selecting previously unselected package liblcms2-2:amd64.
Preparing to unpack .../10-liblcms2-2_2.9-3_amd64.deb ...
Unpacking liblcms2-2:amd64 (2.9-3) ...
Selecting previously unselected package libsm6:amd64.
Preparing to unpack .../11-libsm6_2%3a1.2.3-1_amd64.deb ...
Unpacking libsm6:amd64 (2:1.2.3-1) ...
Selecting previously unselected package libwebpmux3:amd64.
Preparing to unpack .../12-libwebpmux3_0.6.1-2_amd64.deb ...
Unpacking libwebpmux3:amd64 (0.6.1-2) ...
Selecting previously unselected package libxau6:amd64.
Preparing to unpack .../13-libxau6_1%3a1.0.8-1+b2_amd64.deb ...
Unpacking libxau6:amd64 (1:1.0.8-1+b2) ...
Selecting previously unselected package libxdmcp6:amd64.
Preparing to unpack .../14-libxdmcp6_1%3a1.1.2-3_amd64.deb ...
Unpacking libxdmcp6:amd64 (1:1.1.2-3) ...
Selecting previously unselected package libxcb1:amd64.
Preparing to unpack .../15-libxcb1_1.13.1-2_amd64.deb ...
Unpacking libxcb1:amd64 (1.13.1-2) ...
Selecting previously unselected package libx11-data.
Preparing to unpack .../16-libx11-data_2%3a1.6.7-1+deb10u1_all.deb ...
Unpacking libx11-data (2:1.6.7-1+deb10u1) ...
Selecting previously unselected package libx11-6:amd64.
Preparing to unpack .../17-libx11-6_2%3a1.6.7-1+deb10u1_amd64.deb ...
Unpacking libx11-6:amd64 (2:1.6.7-1+deb10u1) ...
Selecting previously unselected package libwmf0.2-7:amd64.
Preparing to unpack .../18-libwmf0.2-7_0.2.8.4-14_amd64.deb ...
Unpacking libwmf0.2-7:amd64 (0.2.8.4-14) ...
Selecting previously unselected package libxext6:amd64.
Preparing to unpack .../19-libxext6_2%3a1.3.3-1+b2_amd64.deb ...
Unpacking libxext6:amd64 (2:1.3.3-1+b2) ...
Selecting previously unselected package libgraphicsmagick-q16-3.
Preparing to unpack .../20-libgraphicsmagick-q16-3_1.4+really1.3.35-1~deb10u1_amd64.deb ...
Unpacking libgraphicsmagick-q16-3 (1.4+really1.3.35-1~deb10u1) ...
Selecting previously unselected package graphicsmagick.
Preparing to unpack .../21-graphicsmagick_1.4+really1.3.35-1~deb10u1_amd64.deb ...
Unpacking graphicsmagick (1.4+really1.3.35-1~deb10u1) ...
Selecting previously unselected package icu-devtools.
Preparing to unpack .../22-icu-devtools_63.1-6+deb10u1_amd64.deb ...
Unpacking icu-devtools (63.1-6+deb10u1) ...
Selecting previously unselected package libbz2-dev:amd64.
Preparing to unpack .../23-libbz2-dev_1.0.6-9.2~deb10u1_amd64.deb ...
Unpacking libbz2-dev:amd64 (1.0.6-9.2~deb10u1) ...
Selecting previously unselected package libexif12:amd64.
Preparing to unpack .../24-libexif12_0.6.21-5.1+deb10u5_amd64.deb ...
Unpacking libexif12:amd64 (0.6.21-5.1+deb10u5) ...
Selecting previously unselected package libexif-dev:amd64.
Preparing to unpack .../25-libexif-dev_0.6.21-5.1+deb10u5_amd64.deb ...
Unpacking libexif-dev:amd64 (0.6.21-5.1+deb10u5) ...
Selecting previously unselected package zlib1g-dev:amd64.
Preparing to unpack .../26-zlib1g-dev_1%3a1.2.11.dfsg-1_amd64.deb ...
Unpacking zlib1g-dev:amd64 (1:1.2.11.dfsg-1) ...
Selecting previously unselected package libpng-dev:amd64.
Preparing to unpack .../27-libpng-dev_1.6.36-6_amd64.deb ...
Unpacking libpng-dev:amd64 (1.6.36-6) ...
Selecting previously unselected package libfreetype6-dev:amd64.
Preparing to unpack .../28-libfreetype6-dev_2.9.1-3+deb10u2_amd64.deb ...
Unpacking libfreetype6-dev:amd64 (2.9.1-3+deb10u2) ...
Selecting previously unselected package libjpeg62-turbo-dev:amd64.
Preparing to unpack .../29-libjpeg62-turbo-dev_1%3a1.5.2-2+deb10u1_amd64.deb ...
Unpacking libjpeg62-turbo-dev:amd64 (1:1.5.2-2+deb10u1) ...
Selecting previously unselected package libjpeg-dev.
Preparing to unpack .../30-libjpeg-dev_1%3a1.5.2-2+deb10u1_all.deb ...
Unpacking libjpeg-dev (1:1.5.2-2+deb10u1) ...
Selecting previously unselected package liblcms2-dev:amd64.
Preparing to unpack .../31-liblcms2-dev_2.9-3_amd64.deb ...
Unpacking liblcms2-dev:amd64 (2.9-3) ...
Selecting previously unselected package xorg-sgml-doctools.
Preparing to unpack .../32-xorg-sgml-doctools_1%3a1.11-1_all.deb ...
Unpacking xorg-sgml-doctools (1:1.11-1) ...
Selecting previously unselected package x11proto-dev.
Preparing to unpack .../33-x11proto-dev_2018.4-4_all.deb ...
Unpacking x11proto-dev (2018.4-4) ...
Selecting previously unselected package x11proto-core-dev.
Preparing to unpack .../34-x11proto-core-dev_2018.4-4_all.deb ...
Unpacking x11proto-core-dev (2018.4-4) ...
Selecting previously unselected package libxau-dev:amd64.
Preparing to unpack .../35-libxau-dev_1%3a1.0.8-1+b2_amd64.deb ...
Unpacking libxau-dev:amd64 (1:1.0.8-1+b2) ...
Selecting previously unselected package libxdmcp-dev:amd64.
Preparing to unpack .../36-libxdmcp-dev_1%3a1.1.2-3_amd64.deb ...
Unpacking libxdmcp-dev:amd64 (1:1.1.2-3) ...
Selecting previously unselected package xtrans-dev.
Preparing to unpack .../37-xtrans-dev_1.3.5-1_all.deb ...
Unpacking xtrans-dev (1.3.5-1) ...
Selecting previously unselected package libpthread-stubs0-dev:amd64.
Preparing to unpack .../38-libpthread-stubs0-dev_0.4-1_amd64.deb ...
Unpacking libpthread-stubs0-dev:amd64 (0.4-1) ...
Selecting previously unselected package libxcb1-dev:amd64.
Preparing to unpack .../39-libxcb1-dev_1.13.1-2_amd64.deb ...
Unpacking libxcb1-dev:amd64 (1.13.1-2) ...
Selecting previously unselected package libx11-dev:amd64.
Preparing to unpack .../40-libx11-dev_2%3a1.6.7-1+deb10u1_amd64.deb ...
Unpacking libx11-dev:amd64 (2:1.6.7-1+deb10u1) ...
Selecting previously unselected package libwmf-dev.
Preparing to unpack .../41-libwmf-dev_0.2.8.4-14_amd64.deb ...
Unpacking libwmf-dev (0.2.8.4-14) ...
Selecting previously unselected package libice-dev:amd64.
Preparing to unpack .../42-libice-dev_2%3a1.0.9-2_amd64.deb ...
Unpacking libice-dev:amd64 (2:1.0.9-2) ...
Selecting previously unselected package libsm-dev:amd64.
Preparing to unpack .../43-libsm-dev_2%3a1.2.3-1_amd64.deb ...
Unpacking libsm-dev:amd64 (2:1.2.3-1) ...
Selecting previously unselected package x11proto-xext-dev.
Preparing to unpack .../44-x11proto-xext-dev_2018.4-4_all.deb ...
Unpacking x11proto-xext-dev (2018.4-4) ...
Selecting previously unselected package libxext-dev:amd64.
Preparing to unpack .../45-libxext-dev_2%3a1.3.3-1+b2_amd64.deb ...
Unpacking libxext-dev:amd64 (2:1.3.3-1+b2) ...
Selecting previously unselected package libicu-dev:amd64.
Preparing to unpack .../46-libicu-dev_63.1-6+deb10u1_amd64.deb ...
Unpacking libicu-dev:amd64 (63.1-6+deb10u1) ...
Selecting previously unselected package libxml2-dev:amd64.
Preparing to unpack .../47-libxml2-dev_2.9.4+dfsg1-7+deb10u1_amd64.deb ...
Unpacking libxml2-dev:amd64 (2.9.4+dfsg1-7+deb10u1) ...
Selecting previously unselected package libjbig-dev:amd64.
Preparing to unpack .../48-libjbig-dev_2.1-3.1+b2_amd64.deb ...
Unpacking libjbig-dev:amd64 (2.1-3.1+b2) ...
Selecting previously unselected package liblzma-dev:amd64.
Preparing to unpack .../49-liblzma-dev_5.2.4-1_amd64.deb ...
Unpacking liblzma-dev:amd64 (5.2.4-1) ...
Selecting previously unselected package libtiffxx5:amd64.
Preparing to unpack .../50-libtiffxx5_4.1.0+git191117-2~deb10u1_amd64.deb ...
Unpacking libtiffxx5:amd64 (4.1.0+git191117-2~deb10u1) ...
Selecting previously unselected package libtiff-dev:amd64.
Preparing to unpack .../51-libtiff-dev_4.1.0+git191117-2~deb10u1_amd64.deb ...
Unpacking libtiff-dev:amd64 (4.1.0+git191117-2~deb10u1) ...
Selecting previously unselected package libltdl7:amd64.
Preparing to unpack .../52-libltdl7_2.4.6-9_amd64.deb ...
Unpacking libltdl7:amd64 (2.4.6-9) ...
Selecting previously unselected package libltdl-dev:amd64.
Preparing to unpack .../53-libltdl-dev_2.4.6-9_amd64.deb ...
Unpacking libltdl-dev:amd64 (2.4.6-9) ...
Selecting previously unselected package libwebpdemux2:amd64.
Preparing to unpack .../54-libwebpdemux2_0.6.1-2_amd64.deb ...
Unpacking libwebpdemux2:amd64 (0.6.1-2) ...
Selecting previously unselected package libwebp-dev:amd64.
Preparing to unpack .../55-libwebp-dev_0.6.1-2_amd64.deb ...
Unpacking libwebp-dev:amd64 (0.6.1-2) ...
Selecting previously unselected package libzstd-dev:amd64.
Preparing to unpack .../56-libzstd-dev_1.3.8+dfsg-3+deb10u2_amd64.deb ...
Unpacking libzstd-dev:amd64 (1.3.8+dfsg-3+deb10u2) ...
Selecting previously unselected package libgraphicsmagick1-dev.
Preparing to unpack .../57-libgraphicsmagick1-dev_1.4+really1.3.35-1~deb10u1_amd64.deb ...
Unpacking libgraphicsmagick1-dev (1.4+really1.3.35-1~deb10u1) ...
Setting up liblcms2-2:amd64 (2.9-3) ...
Setting up libxau6:amd64 (1:1.0.8-1+b2) ...
Setting up libxdmcp6:amd64 (1:1.1.2-3) ...
Setting up libxcb1:amd64 (1.13.1-2) ...
Setting up libzstd-dev:amd64 (1.3.8+dfsg-3+deb10u2) ...
Setting up x11-common (1:7.7+19) ...
debconf: unable to initialize frontend: Dialog
debconf: (TERM is not set, so the dialog frontend is not usable.)
debconf: falling back to frontend: Readline
update-rc.d: warning: start and stop actions are no longer supported; falling back to defaults
invoke-rc.d: could not determine current runlevel
invoke-rc.d: policy-rc.d denied execution of start.
Setting up libpthread-stubs0-dev:amd64 (0.4-1) ...
Setting up libjbig0:amd64 (2.1-3.1+b2) ...
Setting up xtrans-dev (1.3.5-1) ...
Setting up autotools-dev (20180224.1) ...
Setting up libjpeg62-turbo:amd64 (1:1.5.2-2+deb10u1) ...
Setting up libx11-data (2:1.6.7-1+deb10u1) ...
Setting up libjpeg62-turbo-dev:amd64 (1:1.5.2-2+deb10u1) ...
Setting up libexif12:amd64 (0.6.21-5.1+deb10u5) ...
Setting up libpng16-16:amd64 (1.6.36-6) ...
Setting up libwebp6:amd64 (0.6.1-2) ...
Setting up icu-devtools (63.1-6+deb10u1) ...
Setting up libltdl7:amd64 (2.4.6-9) ...
Setting up liblcms2-dev:amd64 (2.9-3) ...
Setting up liblzma-dev:amd64 (5.2.4-1) ...
Setting up zlib1g-dev:amd64 (1:1.2.11.dfsg-1) ...
Setting up libx11-6:amd64 (2:1.6.7-1+deb10u1) ...
Setting up xorg-sgml-doctools (1:1.11-1) ...
Setting up libtiff5:amd64 (4.1.0+git191117-2~deb10u1) ...
Setting up libwebpmux3:amd64 (0.6.1-2) ...
Setting up libicu-dev:amd64 (63.1-6+deb10u1) ...
Setting up libtiffxx5:amd64 (4.1.0+git191117-2~deb10u1) ...
Setting up libbz2-dev:amd64 (1.0.6-9.2~deb10u1) ...
Setting up automake (1:1.16.1-4) ...
update-alternatives:
using /usr/bin/automake-1.16 to provide /usr/bin/automake (automake) in auto mode
update-alternatives: warning:
skip creation of /usr/share/man/man1/automake.1.gz because associated file /usr/share/man/man1/automake-1.16.1.gz (of link group automake) doesn't exist
update-alternatives: warning:
skip creation of /usr/share/man/man1/aclocal.1.gz because associated file /usr/share/man/man1/aclocal-1.16.1.gz (of link group automake) doesn't exist
Setting up x11proto-dev (2018.4-4) ...
Setting up libice6:amd64 (2:1.0.9-2) ...
Setting up libexif-dev:amd64 (0.6.21-5.1+deb10u5) ...
Setting up libxau-dev:amd64 (1:1.0.8-1+b2) ...
Setting up libice-dev:amd64 (2:1.0.9-2) ...
Setting up libwebpdemux2:amd64 (0.6.1-2) ...
Setting up libpng-dev:amd64 (1.6.36-6) ...
Setting up libjpeg-dev (1:1.5.2-2+deb10u1) ...
Setting up libjbig-dev:amd64 (2.1-3.1+b2) ...
Setting up libxext6:amd64 (2:1.3.3-1+b2) ...
Setting up libltdl-dev:amd64 (2.4.6-9) ...
Setting up libxdmcp-dev:amd64 (1:1.1.2-3) ...
Setting up libxml2-dev:amd64 (2.9.4+dfsg1-7+deb10u1) ...
Setting up libwebp-dev:amd64 (0.6.1-2) ...
Setting up libfreetype6:amd64 (2.9.1-3+deb10u2) ...
Setting up libtiff-dev:amd64 (4.1.0+git191117-2~deb10u1) ...
Setting up x11proto-core-dev (2018.4-4) ...
Setting up x11proto-xext-dev (2018.4-4) ...
Setting up libsm6:amd64 (2:1.2.3-1) ...
Setting up libxcb1-dev:amd64 (1.13.1-2) ...
Setting up libwmf0.2-7:amd64 (0.2.8.4-14) ...
Setting up libsm-dev:amd64 (2:1.2.3-1) ...
Setting up libx11-dev:amd64 (2:1.6.7-1+deb10u1) ...
Setting up libfreetype6-dev:amd64 (2.9.1-3+deb10u2) ...
Setting up libwmf-dev (0.2.8.4-14) ...
Setting up libgraphicsmagick-q16-3 (1.4+really1.3.35-1~deb10u1) ...
Setting up libxext-dev:amd64 (2:1.3.3-1+b2) ...
Setting up libgraphicsmagick1-dev (1.4+really1.3.35-1~deb10u1) ...
Setting up graphicsmagick (1.4+really1.3.35-1~deb10u1) ...
Processing triggers for libc-bin (2.28-10) ...
Removing intermediate container a1cba0c20fcc
---> 9057e865956a
Step 4/4 : RUN svn checkout --revision HEAD https://svn.php.net/repository/pecl/gmagick /tmp/ext-src && cd /tmp/ext-src/trunk && phpize && ./configure --with-gmagick && make && make test
---> Running in f5d8c528ebe9
A    ext-src/trunk
A    ext-src/trunk/tests
A    ext-src/trunk/tests/gmagick-077-cropthumbnail.phpt
A    ext-src/trunk/tests/gmagick-104-setgetimagepage.phpt
A    ext-src/trunk/gmagick_helpers.c
A    ext-src/trunk/tests/gmagick-120_writeImageFile.phpt
A    ext-src/trunk/tests/gmagickdraw_038_setFontStretch_basic.phpt
A    ext-src/trunk/gmagick_methods.c
A    ext-src/trunk/gmagickdraw_methods.c
A    ext-src/trunk/tests/gmagickdraw-026-setgravity_getgravity.phpt
A    ext-src/trunk/gmagickpixel_methods.c
A    ext-src/trunk/tests/gmagick-129_gettersAndSetters.phpt
A    ext-src/trunk/tests/gmagickdraw_041_popDefs_basic.phpt
A    ext-src/trunk/package.xml
A    ext-src/trunk/tests/gmagick-113_compareImages.phpt
A    ext-src/trunk/php_gmagick.h
A    ext-src/trunk/tests/gmagickdraw-020-polyline.phpt
A    ext-src/trunk/tests/gmagickdraw_037_setFillRule_basic.phpt
A    ext-src/trunk/gmagick.c
A    ext-src/trunk/tests/gmagickdraw-032_circle_basic.phpt
A    ext-src/trunk/tests/gmagick-110_blackThresholdImage_basic.phpt
A    ext-src/trunk/README.md
A    ext-src/trunk/tests/gmagick-116_waveImage_basic.phpt
A    ext-src/trunk/tests/gmagickpixel-005-setcolorvaluequantum_getcolorvaluequantum.phpt
A    ext-src/trunk/tests/gmagickdraw_039_pathStart_basic.phpt
A    ext-src/trunk/tests/gmagick-065-mapimage.phpt
A    ext-src/trunk/tests/gmagick-112_colorizeImage_basic.phpt
A    ext-src/trunk/tests/gmagickdraw_035_setClipUnits_basic.phpt
A    ext-src/trunk/tests/gmagickdraw_043_setViewBox_basic.phpt
A    ext-src/trunk/tests/gmagick-106-testConstants.phpt
A    ext-src/trunk/tests/gmagick-108_adaptiveThresholdImage_basic.phpt
A    ext-src/trunk/tests/gmagick-103-setgetimagecompression.phpt
A    ext-src/trunk/tests/gmagick-114_convolveImage_6.phpt
A    ext-src/trunk/tests/gmagickdraw_042_setTextAntialias_basic.phpt
A    ext-src/trunk/tests/gmagickdraw-030-setmiterlimit_getmiterlimit.phpt
A    ext-src/trunk/tests/gmagickdraw-031-setdashstrokearray_getdashstrokearray.phpt
A    ext-src/trunk/tests/Vera.ttf
A    ext-src/trunk/tests/gmagick-109_affineTransformImage_basic.phpt
A    ext-src/trunk/tests/gmagickdraw-029-setlinejoin_getlinejoin.phpt
A    ext-src/trunk/tests/gmagickdraw_034_setClipRule_basic.phpt
A    ext-src/trunk/tests/gmagickdraw-028-setlinecap_getlinecap.phpt
A    ext-src/trunk/tests/gmagick-128_staticMethods.phpt
A    ext-src/trunk/tests/gmagick-025-set_and_getimageckgroundcolor_q16.phpt
A    ext-src/trunk/tests/gmagick-027-set_getimagebordercolor_q16.phpt
A    ext-src/trunk/tests/gmagickdraw-013-setstrokecolor_getstrokecolor_q16.phpt
A    ext-src/trunk/tests/gmagick-105-readimageblob.phpt
A    ext-src/trunk/tests/gmagickdraw-013-setstrokecolor_getstrokecolor.phpt
A    ext-src/trunk/tests/gmagickdraw-006-setfillcolor_getfillcolor.phpt
A    ext-src/trunk/tests/gmagick-122_unsharpMaskImage_basic.phpt
A    ext-src/trunk/tests/gmagick-115_equalizeImage_case2.phpt
A    ext-src/trunk/tests/gmagick-027-set_getimagebordercolor.phpt
A    ext-src/trunk/tests/gmagick-123_sharpenImage_basic.phpt
A    ext-src/trunk/tests/gmagickpixel-001-setcolor_getcolor.phpt
A    ext-src/trunk/tests/gmagick-101-sharpenimage.phpt
A    ext-src/trunk/tests/gmagick-117_haldClutImage_basic.phpt
A    ext-src/trunk/tests/gmagick-126_negateImage_basic.phpt
A    ext-src/trunk/tests/gmagick-100-coalesceimages.phpt
A    ext-src/trunk/tests/gmagick-097-sampleimage.phpt
A    ext-src/trunk/tests/gmagick-054-getquantumdepth.phpt
A    ext-src/trunk/tests/gmagick-121_deconstructGif_basic.phpt
A    ext-src/trunk/tests/gmagick-094-thresholdimage.phpt
A    ext-src/trunk/tests/gmagick-098-cloneimage.phpt
A    ext-src/trunk/tests/gmagick-125_radialBlurImage_basic.phpt
A    ext-src/trunk/tests/gmagick-095-negateimage.phpt
A    ext-src/trunk/tests/gmagickdraw_045_setFontFamily_basic.phpt
A    ext-src/trunk/tests/gmagick-093-flattenimages.phpt
A    ext-src/trunk/tests/gmagickdraw-025-affine.phpt
A    ext-src/trunk/tests/gmagick-111_whiteThresholdImage_basic.phpt
A    ext-src/trunk/tests/gmagick-090-setimage.phpt
A    ext-src/trunk/tests/gmagick-088-getimageblob.phpt
A    ext-src/trunk/tests/gmagick-118_shaveImage_basic.phpt
A    ext-src/trunk/tests/gmagick-092-getimagegeometry.phpt
A    ext-src/trunk/tests/gmagick-004-composite_variations.phpt
A    ext-src/trunk/tests/gmagick-119_thumbnail_fill.phpt
A    ext-src/trunk/tests/gmagick-089-getnumberimages.phpt
A    ext-src/trunk/tests/gmagick-124__reduceNoiseImage_basic.phpt
A    ext-src/trunk/tests/gmagick-013-commentimage.phpt
A    ext-src/trunk/tests/gmagickpixel-004-clone.phpt
A    ext-src/trunk/tests/gmagick-087-setcompressionquality.phpt
A    ext-src/trunk/tests/hald_8.png
A    ext-src/trunk/tests/gmagickdraw-012-setstrokeopacity_getstrokeopacity.phpt
A    ext-src/trunk/tests/gmagick-081-separateimagechannel.phpt
A    ext-src/trunk/tests/gmagickdraw-033_setClipPath_basic.phpt
A    ext-src/trunk/tests/gmagickdraw-019-polygon.phpt
A    ext-src/trunk/tests/gmagick-024-getcopyright_getfilename.phpt
A    ext-src/trunk/tests/gmagickdraw-022-rotate.phpt
A    ext-src/trunk/tests/gmagick-043-set_getimageprofile.phpt
A    ext-src/trunk/tests/gmagick-107_setimagevirtualpixelmethod.phpt
A    ext-src/trunk/tests/gmagick-045-set_getimagerenderingintent.phpt
A    ext-src/trunk/tests/gmagick-086-swirlimage.phpt
A    ext-src/trunk/tests/gmagick-127_contrastImage_basic.phpt
A    ext-src/trunk/tests/gmagick-076-queryfonts.phpt
A    ext-src/trunk/tests/gmagickdraw_040_pathCurveToQuadraticBezierAbsolute_basic.phpt
A    ext-src/trunk/tests/gmagick-052-getimagewidth.phpt
A    ext-src/trunk/tests/gmagickdraw-010-setfontstyle_getfontstyle.phpt
A    ext-src/trunk/tests/gmagick-005-draw.phpt
A    ext-src/trunk/tests/gmagickdraw_036_pushPattern_basic.phpt
A    ext-src/trunk/tests/gmagickdraw-008-setfont_getfont.phpt
A    ext-src/trunk/tests/gmagick-017-destroy.phpt
A    ext-src/trunk/tests/gmagickdraw_044_setTextUnderColor_basic.phpt
A    ext-src/trunk/tests/gmagick-002-crop_variations.phpt
A    ext-src/trunk/tests/gmagick-006-annotateimage.phpt
A    ext-src/trunk/tests/gmagickdraw-002-ellipse.phpt
A    ext-src/trunk/tests/gmagickdraw-007-setfillopacity_getfillopacity.phpt
A    ext-src/trunk/tests/gmagickdraw-027-setantialias_getantialias.phpt
A    ext-src/trunk/tests/gmagick-056-set_getsamplingfactors.phpt
A    ext-src/trunk/tests/gmagick-047-set_getimagescene.phpt
A    ext-src/trunk/tests/gmagickdraw-006-setfillcolor_getfillcolor_q16.phpt
A    ext-src/trunk/tests/gmagickdraw-004-arc.phpt
A    ext-src/trunk/tests/gmagick-041-set_getimageinterlacescheme.phpt
A    ext-src/trunk/tests/gmagick-062-labelimage.phpt
A    ext-src/trunk/tests/gmagick-025-set_and_getimageckgroundcolor.phpt
A    ext-src/trunk/tests/gmagick-072-oilpaintimage.phpt
A    ext-src/trunk/tests/gmagick-050-set_getimageunits.phpt
A    ext-src/trunk/tests/gmagick-012-chopimage.phpt
A    ext-src/trunk/tests/gmagickpixel-003-getcolorcount.phpt
A    ext-src/trunk/tests/gmagick-102-unsharpenmaskimage.phpt
A    ext-src/trunk/tests/gmagick-031-set_getimagecompose.phpt
A    ext-src/trunk/tests/gmagick-099-appendimages.phpt
A    ext-src/trunk/tests/gmagick-034-set_getimagedispose.phpt
A    ext-src/trunk/tests/gmagick-096-setinterlacescheme.phpt
A    ext-src/trunk/tests/gmagick-019-embossimage.phpt
A    ext-src/trunk/tests/gmagick-040-getimagehistogram.phpt
A    ext-src/trunk/tests/gmagick-057-set_getsize.phpt
A    ext-src/trunk/tests/gmagick-091-getimage.phpt
A    ext-src/trunk/tests/gmagick-083-solarizeimage.phpt
A    ext-src/trunk/tests/gmagick-016-despeckleimage.phpt
A    ext-src/trunk/tests/gmagick-049-set_getimagetype.phpt
A    ext-src/trunk/tests/gmagick-035-set_getfilename.phpt
A    ext-src/trunk/tests/gmagick-048-getimagesignature.phpt
A    ext-src/trunk/tests/gmagick-051-set_getimagewhitepoint.phpt
A    ext-src/trunk/tests/gmagick-074-quantizeimage.phpt
A    ext-src/trunk/tests/gmagickdraw-011-setfontweight_getfontweight.phpt
A    ext-src/trunk/tests/gmagick-079-rotateimage.phpt
A    ext-src/trunk/tests/gmagick-073-profileimage.phpt
A    ext-src/trunk/tests/gmagick-026-set_getimageblueprimary.phpt
A    ext-src/trunk/tests/gmagickdraw-018-point.phpt
A    ext-src/trunk/tests/gmagick-021-equalizeimage.phpt
A    ext-src/trunk/tests/gmagick-032-set_getimagedelay.phpt
A    ext-src/trunk/tests/gmagick-029-set_getimagecolorspace.phpt
A    ext-src/trunk/tests/gmagick-055-getreleasedate.phpt
A    ext-src/trunk/tests/gmagick-033-set_getimagedepth.phpt
A    ext-src/trunk/tests/gmagick-028-set_getimagechanneldepth.phpt
A    ext-src/trunk/tests/gmagickdraw-021-rectangle.phpt
A    ext-src/trunk/tests/gmagick-069-trimimage.phpt
A    ext-src/trunk/tests/gmagick-084-spreadimage.phpt
A    ext-src/trunk/tests/gmagick-078-rollimage.phpt
A    ext-src/trunk/tests/gmagickdraw-003-annotate.phpt
A    ext-src/trunk/tests/gmagick-075-quantizeimages.phpt
A    ext-src/trunk/tests/gmagickdraw-023-roundrectangle.phpt
A    ext-src/trunk/tests/gmagick-038-setimagegreenprimary.phpt
A    ext-src/trunk/tests/gmagick-082-shearimage.phpt
A    ext-src/trunk/tests/gmagick-080-scaleimage.phpt
A    ext-src/trunk/tests/gmagickdraw-005-bezier.phpt
A    ext-src/trunk/tests/gmagickdraw-009-setfontsize_getfontsize.phpt
A    ext-src/trunk/tests/gmagick-008-addimage.phpt
A    ext-src/trunk/tests/gmagick-030-getimagecolors.phpt
A    ext-src/trunk/tests/gmagick-015-cyclecolormapimage.phpt
A    ext-src/trunk/tests/gmagick-023-gammaimage.phpt
A    ext-src/trunk/tests/gmagick-036-set_getimagefilename.phpt
A    ext-src/trunk/tests/gmagick-059-hasnextimage.phpt
A    ext-src/trunk/tests/gmagick-037-set_getimagegamma.phpt
A    ext-src/tags
A    ext-src/tags/2.0.1RC3
A    ext-src/trunk/tests/gmagickdraw-015-settextdecoration_gettextdecoration.phpt
A    ext-src/trunk/tests/gmagick-067-minifyimage.phpt
A    ext-src/trunk/tests/gmagick-061-implodeimage.phpt
A    ext-src/trunk/tests/gmagickdraw-017-line.phpt
A    ext-src/trunk/tests/gmagick-046-set_getimagerresolution.phpt
A    ext-src/trunk/tests/gmagick-018-edgeimage.phpt
A    ext-src/trunk/tests/gmagick-064-magnifyimage.phpt
A    ext-src/trunk/tests/gmagick-011-charcoalimage.phpt
A    ext-src/tags/2.0.1RC3/tests
A    ext-src/trunk/tests/gmagick-007-blurimage.phpt
A    ext-src/trunk/tests/gmagick-066-medianfilterimage.phpt
A    ext-src/trunk/tests/gmagick-039-getimageheight.phpt
A    ext-src/trunk/tests/gmagick-010-borderimage.phpt
A    ext-src/trunk/tests/gmagick-085-stripimage.phpt
A    ext-src/trunk/tests/gmagickdraw-014-setstrokewidth_getstrokewidth.phpt
A    ext-src/trunk/tests/gmagick-009-addimagenoise.phpt
A    ext-src/trunk/tests/gmagick-063-levelimage.phpt
A    ext-src/trunk/tests/gmagickpixel-002-setcolorvalue_getcolorvalue.phpt
A    ext-src/trunk/tests/gmagick-044-set_getimageredprimary.phpt
A    ext-src/trunk/tests/gmagickdraw-001-setstrokecolor_setstrokewidth.phpt
A    ext-src/trunk/tests/gmagick-014-current.phpt
A    ext-src/trunk/tests/gmagick-068-modulateimage.phpt
A    ext-src/trunk/tests/gmagick-020-enhanceimage.phpt
A    ext-src/trunk/php_gmagick_helpers.h
A    ext-src/trunk/tests/gmagick-022-flip_and_flop_image.phpt
A    ext-src/trunk/tests/gmagick-003-resize_variations.phpt
A    ext-src/trunk/.travis.yml
A    ext-src/trunk/php_gmagick_macros.h
A    ext-src/trunk/tests/gmagick-053-getpackagename.phpt
A    ext-src/trunk/tests/gmagick-042-set_getimageiterations.phpt
A    ext-src/trunk/config.w32
A    ext-src/trunk/tests/gmagick-001-read_and_write.phpt
A    ext-src/trunk/config.m4
A    ext-src/tags/2.0.1RC3/gmagick_methods.c
A    ext-src/tags/2.0.1RC3/php_gmagick_helpers.h
A    ext-src/trunk/tests/gmagickdraw-024-scale.phpt
A    ext-src/tags/2.0.1RC3/config.m4
A    ext-src/trunk/LICENSE
A    ext-src/tags/2.0.1RC3/.travis.yml
A    ext-src/trunk/tests/gmagick-060-haspreviousimage.phpt
A    ext-src/tags/2.0.1RC3/CONTRIBUTORS.md
A    ext-src/tags/2.0.1RC3/tests/gmagick-108_adaptiveThresholdImage_basic.phpt
A    ext-src/trunk/tests/gmagick-071-next_previousimage.phpt
A    ext-src/tags/2.0.1RC3/tests/gmagickdraw_034_setClipRule_basic.phpt
A    ext-src/tags/2.0.1RC3/tests/gmagickdraw_042_setTextAntialias_basic.phpt
A    ext-src/trunk/tests/gmagick-058-getversion.phpt
A    ext-src/trunk/tests/gmagick-070-motionblurimage.phpt
A    ext-src/tags/2.0.1RC3/gmagickpixel_methods.c
A    ext-src/tags/2.0.1RC3/tests/gmagick-115_equalizeImage_case2.phpt
A    ext-src/tags/2.0.1RC3/tests/gmagick-105-readimageblob.phpt
A    ext-src/trunk/tests/gmagickdraw-016-settextencoding_gettextencoding.phpt
A    ext-src/trunk/CONTRIBUTORS.md
A    ext-src/tags/2.0.1RC3/php_gmagick.h
A    ext-src/tags/2.0.1RC3/gmagick.c
A    ext-src/tags/2.0.1RC3/tests/gmagick-117_haldClutImage_basic.phpt
A    ext-src/tags/2.0.1RC3/tests/gmagickdraw_045_setFontFamily_basic.phpt
A    ext-src/tags/2.0.1RC3/tests/gmagick-129_gettersAndSetters.phpt
A    ext-src/tags/2.0.1RC3/tests/gmagick-113_compareImages.phpt
A    ext-src/tags/2.0.1RC3/tests/gmagickdraw-033_setClipPath_basic.phpt
A    ext-src/tags/2.0.1RC3/tests/gmagick-121_deconstructGif_basic.phpt
A    ext-src/tags/2.0.1RC3/tests/gmagickdraw-026-setgravity_getgravity.phpt
A    ext-src/tags/2.0.1RC3/tests/gmagickdraw_041_popDefs_basic.phpt
A    ext-src/tags/2.0.1RC3/tests/gmagickdraw-020-polyline.phpt
A    ext-src/tags/2.0.1RC3/tests/gmagick-104-setgetimagepage.phpt
A    ext-src/tags/2.0.1RC3/gmagickdraw_methods.c
A    ext-src/tags/2.0.1RC3/README.md
A    ext-src/tags/2.0.1RC3/tests/gmagick-109_affineTransformImage_basic.phpt
A    ext-src/tags/2.0.1RC3/tests/gmagick-122_unsharpMaskImage_basic.phpt
A    ext-src/tags/2.0.1RC3/package.xml
A    ext-src/tags/2.0.1RC3/tests/gmagick-126_negateImage_basic.phpt
A    ext-src/tags/2.0.1RC3/tests/gmagick-110_blackThresholdImage_basic.phpt
A    ext-src/tags/2.0.1RC3/tests/gmagick-127_contrastImage_basic.phpt
A    ext-src/tags/2.0.1RC3/tests/gmagick-114_convolveImage_6.phpt
A    ext-src/tags/2.0.1RC3/tests/gmagick-111_whiteThresholdImage_basic.phpt
A    ext-src/tags/2.0.1RC3/tests/gmagickdraw_038_setFontStretch_basic.phpt
A    ext-src/tags/2.0.1RC3/tests/gmagick-065-mapimage.phpt
A    ext-src/tags/2.0.1RC3/tests/gmagick-128_staticMethods.phpt
A    ext-src/tags/2.0.1RC3/tests/gmagick-119_thumbnail_fill.phpt
A    ext-src/tags/2.0.1RC3/tests/gmagickdraw_039_pathStart_basic.phpt
A    ext-src/tags/2.0.1RC3/tests/gmagick-123_sharpenImage_basic.phpt
A    ext-src/tags/2.0.1RC3/tests/hald_8.png
A    ext-src/tags/2.0.1RC3/tests/gmagick-125_radialBlurImage_basic.phpt
A    ext-src/tags/2.0.1RC3/tests/gmagickdraw_037_setFillRule_basic.phpt
A    ext-src/tags/2.0.1RC3/tests/gmagick-118_shaveImage_basic.phpt
A    ext-src/tags/2.0.1RC3/tests/gmagick-120_writeImageFile.phpt
A    ext-src/tags/2.0.1RC3/tests/gmagick-124__reduceNoiseImage_basic.phpt
A    ext-src/tags/2.0.1RC3/tests/gmagickdraw_040_pathCurveToQuadraticBezierAbsolute_basic.phpt
A    ext-src/tags/2.0.1RC3/tests/gmagick-077-cropthumbnail.phpt
A    ext-src/tags/2.0.1RC3/tests/gmagickdraw_036_pushPattern_basic.phpt
A    ext-src/tags/2.0.1RC3/tests/gmagick-107_setimagevirtualpixelmethod.phpt
A    ext-src/tags/2.0.1RC3/tests/gmagick-106-testConstants.phpt
A    ext-src/tags/2.0.1RC3/tests/gmagick-112_colorizeImage_basic.phpt
A    ext-src/tags/2.0.1RC3/tests/gmagick-116_waveImage_basic.phpt
A    ext-src/tags/2.0.1RC3/tests/gmagickdraw_044_setTextUnderColor_basic.phpt
A    ext-src/tags/2.0.1RC3/tests/gmagick-006-annotateimage.phpt
A    ext-src/tags/2.0.1RC3/tests/gmagickdraw-027-setantialias_getantialias.phpt
A    ext-src/tags/2.0.1RC3/tests/Vera.ttf
A    ext-src/tags/2.0.1RC3/tests/gmagickdraw-006-setfillcolor_getfillcolor_q16.phpt
A    ext-src/tags/2.0.1RC3/tests/gmagickdraw-028-setlinecap_getlinecap.phpt
A    ext-src/tags/2.0.1RC3/tests/gmagickdraw_043_setViewBox_basic.phpt
A    ext-src/tags/2.0.1RC3/tests/gmagickdraw-032_circle_basic.phpt
A    ext-src/tags/2.0.1RC3/tests/gmagick-025-set_and_getimageckgroundcolor.phpt
A    ext-src/tags/2.0.1RC3/tests/gmagickdraw-013-setstrokecolor_getstrokecolor_q16.phpt
A    ext-src/tags/2.0.1RC3/tests/gmagickdraw_035_setClipUnits_basic.phpt
A    ext-src/tags/2.0.1RC3/tests/gmagick-102-unsharpenmaskimage.phpt
A    ext-src/tags/2.0.1RC3/tests/gmagickdraw-006-setfillcolor_getfillcolor.phpt
A    ext-src/tags/2.0.1RC3/tests/gmagickdraw-031-setdashstrokearray_getdashstrokearray.phpt
A    ext-src/tags/2.0.1RC3/tests/gmagick-099-appendimages.phpt
A    ext-src/tags/2.0.1RC3/tests/gmagick-101-sharpenimage.phpt
A    ext-src/tags/2.0.1RC3/tests/gmagick-103-setgetimagecompression.phpt
A    ext-src/tags/2.0.1RC3/tests/gmagickdraw-029-setlinejoin_getlinejoin.phpt
A    ext-src/tags/2.0.1RC3/tests/gmagick-096-setinterlacescheme.phpt
A    ext-src/tags/2.0.1RC3/tests/gmagick-097-sampleimage.phpt
A    ext-src/tags/2.0.1RC3/tests/gmagick-091-getimage.phpt
A    ext-src/tags/2.0.1RC3/tests/gmagick-095-negateimage.phpt
A    ext-src/tags/2.0.1RC3/tests/gmagickdraw-030-setmiterlimit_getmiterlimit.phpt
A    ext-src/tags/2.0.1RC3/tests/gmagick-027-set_getimagebordercolor_q16.phpt
A    ext-src/tags/2.0.1RC3/tests/gmagick-035-set_getfilename.phpt
A    ext-src/tags/2.0.1RC3/tests/gmagickdraw-025-affine.phpt
A    ext-src/tags/2.0.1RC3/tests/gmagick-025-set_and_getimageckgroundcolor_q16.phpt
A    ext-src/tags/2.0.1RC3/tests/gmagick-027-set_getimagebordercolor.phpt
A    ext-src/tags/2.0.1RC3/tests/gmagickdraw-011-setfontweight_getfontweight.phpt
A    ext-src/tags/2.0.1RC3/tests/gmagickdraw-013-setstrokecolor_getstrokecolor.phpt
A    ext-src/tags/2.0.1RC3/tests/gmagick-088-getimageblob.phpt
A    ext-src/tags/2.0.1RC3/tests/gmagick-054-getquantumdepth.phpt
A    ext-src/tags/2.0.1RC3/tests/gmagickpixel-004-clone.phpt
A    ext-src/tags/2.0.1RC3/tests/gmagick-098-cloneimage.phpt
A    ext-src/tags/2.0.1RC3/tests/gmagick-073-profileimage.phpt
A    ext-src/tags/2.0.1RC3/tests/gmagickpixel-001-setcolor_getcolor.phpt
A    ext-src/tags/2.0.1RC3/tests/gmagick-093-flattenimages.phpt
A    ext-src/tags/2.0.1RC3/tests/gmagickdraw-012-setstrokeopacity_getstrokeopacity.phpt
A    ext-src/tags/2.0.1RC3/tests/gmagickdraw-018-point.phpt
A    ext-src/tags/2.0.1RC3/tests/gmagick-100-coalesceimages.phpt
A    ext-src/tags/2.0.1RC3/tests/gmagick-090-setimage.phpt
A    ext-src/tags/2.0.1RC3/tests/gmagick-055-getreleasedate.phpt
A    ext-src/tags/2.0.1RC3/tests/gmagick-094-thresholdimage.phpt
A    ext-src/tags/2.0.1RC3/tests/gmagickdraw-022-rotate.phpt
A    ext-src/tags/2.0.1RC3/tests/gmagick-004-composite_variations.phpt
A    ext-src/tags/2.0.1RC3/tests/gmagick-092-getimagegeometry.phpt
A    ext-src/tags/2.0.1RC3/tests/gmagick-045-set_getimagerenderingintent.phpt
A    ext-src/tags/2.0.1RC3/tests/gmagick-069-trimimage.phpt
A    ext-src/tags/2.0.1RC3/tests/gmagick-013-commentimage.phpt
A    ext-src/tags/2.0.1RC3/tests/gmagick-076-queryfonts.phpt
A    ext-src/tags/2.0.1RC3/tests/gmagick-089-getnumberimages.phpt
A    ext-src/tags/2.0.1RC3/tests/gmagick-024-getcopyright_getfilename.phpt
A    ext-src/tags/2.0.1RC3/tests/gmagick-087-setcompressionquality.phpt
A    ext-src/tags/2.0.1RC3/tests/gmagick-075-quantizeimages.phpt
A    ext-src/tags/2.0.1RC3/tests/gmagick-005-draw.phpt
A    ext-src/tags/2.0.1RC3/tests/gmagick-086-swirlimage.phpt
A    ext-src/tags/2.0.1RC3/tests/gmagick-081-separateimagechannel.phpt
A    ext-src/tags/2.0.1RC3/tests/gmagick-041-set_getimageinterlacescheme.phpt
A    ext-src/tags/2.0.1RC3/tests/gmagick-082-shearimage.phpt
A    ext-src/tags/2.0.1RC3/tests/gmagick-052-getimagewidth.phpt
A    ext-src/tags/2.0.1RC3/tests/gmagickdraw-019-polygon.phpt
A    ext-src/tags/2.0.1RC3/tests/gmagick-050-set_getimageunits.phpt
A    ext-src/tags/2.0.1RC3/tests/gmagickdraw-009-setfontsize_getfontsize.phpt
A    ext-src/tags/2.0.1RC3/tests/gmagick-043-set_getimageprofile.phpt
A    ext-src/tags/2.0.1RC3/tests/gmagickdraw-008-setfont_getfont.phpt
A    ext-src/tags/2.0.1RC3/tests/gmagick-023-gammaimage.phpt
A    ext-src/tags/2.0.1RC3/tests/gmagick-031-set_getimagecompose.phpt
A    ext-src/tags/2.0.1RC3/tests/gmagickdraw-010-setfontstyle_getfontstyle.phpt
A    ext-src/tags/2.0.1RC3/tests/gmagick-059-hasnextimage.phpt
A    ext-src/tags/2.0.1RC3/tests/gmagick-002-crop_variations.phpt
A    ext-src/tags/2.0.1RC3/tests/gmagick-034-set_getimagedispose.phpt
A    ext-src/tags/2.0.1RC3/tests/gmagickdraw-007-setfillopacity_getfillopacity.phpt
A    ext-src/tags/2.0.1RC3/tests/gmagick-061-implodeimage.phpt
A    ext-src/tags/2.0.1RC3/tests/gmagick-017-destroy.phpt
A    ext-src/tags/2.0.1RC3/tests/gmagick-057-set_getsize.phpt
A    ext-src/tags/2.0.1RC3/tests/gmagick-064-magnifyimage.phpt
A    ext-src/tags/2.0.1RC3/tests/gmagick-083-solarizeimage.phpt
A    ext-src/tags/2.0.1RC3/tests/gmagickdraw-002-ellipse.phpt
A    ext-src/tags/2.0.1RC3/tests/gmagick-047-set_getimagescene.phpt
A    ext-src/tags/2.0.1RC3/tests/gmagick-007-blurimage.phpt
A    ext-src/tags/2.0.1RC3/tests/gmagick-074-quantizeimage.phpt
A    ext-src/tags/2.0.1RC3/tests/gmagick-056-set_getsamplingfactors.phpt
A    ext-src/tags/2.0.1RC3/tests/gmagick-062-labelimage.phpt
A    ext-src/tags/2.0.1RC3/tests/gmagick-085-stripimage.phpt
A    ext-src/tags/2.0.1RC3/tests/gmagick-026-set_getimageblueprimary.phpt
A    ext-src/tags/2.0.1RC3/tests/gmagickdraw-004-arc.phpt
A    ext-src/tags/2.0.1RC3/tests/gmagickpixel-003-getcolorcount.phpt
A    ext-src/tags/2.0.1RC3/tests/gmagick-063-levelimage.phpt
A    ext-src/tags/2.0.1RC3/tests/gmagick-029-set_getimagecolorspace.phpt
A    ext-src/tags/2.0.1RC3/tests/gmagick-072-oilpaintimage.phpt
A    ext-src/tags/2.0.1RC3/tests/gmagick-040-getimagehistogram.phpt
A    ext-src/tags/2.0.1RC3/tests/gmagickdraw-021-rectangle.phpt
A    ext-src/tags/2.0.1RC3/tests/gmagickpixel-002-setcolorvalue_getcolorvalue.phpt
A    ext-src/tags/2.0.1RC3/tests/gmagick-012-chopimage.phpt
A    ext-src/tags/2.0.1RC3/tests/gmagick-016-despeckleimage.phpt
A    ext-src/tags/2.0.1RC3/tests/gmagickdraw-003-annotate.phpt
A    ext-src/tags/2.0.1RC3/tests/gmagick-068-modulateimage.phpt
A    ext-src/tags/2.0.1RC3/tests/gmagick-019-embossimage.phpt
A    ext-src/tags/2.0.1RC3/tests/gmagick-051-set_getimagewhitepoint.phpt
A    ext-src/tags/2.0.1RC3/tests/gmagick-049-set_getimagetype.phpt
A    ext-src/tags/2.0.1RC3/tests/gmagick-022-flip_and_flop_image.phpt
A    ext-src/tags/2.0.1RC3/tests/gmagickdraw-023-roundrectangle.phpt
A    ext-src/tags/2.0.1RC3/tests/gmagick-079-rotateimage.phpt
A    ext-src/tags/2.0.1RC3/tests/gmagick-048-getimagesignature.phpt
A    ext-src/branches
A    ext-src/branches/poc
A    ext-src/tags/2.0.1RC3/tests/gmagick-053-getpackagename.phpt
A    ext-src/tags/2.0.1RC3/tests/gmagick-021-equalizeimage.phpt
A    ext-src/tags/2.0.1RC3/tests/gmagickdraw-005-bezier.phpt
A    ext-src/tags/2.0.1RC3/tests/gmagick-032-set_getimagedelay.phpt
A    ext-src/branches/poc/tests
A    ext-src/tags/2.0.1RC3/tests/gmagick-001-read_and_write.phpt
A    ext-src/tags/2.0.1RC3/tests/gmagick-033-set_getimagedepth.phpt
A    ext-src/tags/2.0.1RC3/tests/gmagick-030-getimagecolors.phpt
A    ext-src/tags/2.0.1RC3/tests/gmagick-028-set_getimagechanneldepth.phpt
A    ext-src/tags/2.0.1RC3/tests/gmagickdraw-024-scale.phpt
A    ext-src/tags/2.0.1RC3/tests/gmagick-084-spreadimage.phpt
A    ext-src/tags/2.0.1RC3/tests/gmagick-067-minifyimage.phpt
A    ext-src/tags/2.0.1RC3/tests/gmagick-078-rollimage.phpt
A    ext-src/tags/2.0.1RC3/tests/gmagick-060-haspreviousimage.phpt
A    ext-src/tags/2.0.1RC3/tests/gmagick-080-scaleimage.phpt
A    ext-src/tags/2.0.1RC3/tests/gmagick-018-edgeimage.phpt
A    ext-src/tags/2.0.1RC3/tests/gmagick-038-setimagegreenprimary.phpt
A    ext-src/tags/2.0.1RC3/tests/gmagick-071-next_previousimage.phpt
A    ext-src/tags/2.0.1RC3/tests/gmagick-015-cyclecolormapimage.phpt
A    ext-src/tags/2.0.1RC3/tests/gmagick-066-medianfilterimage.phpt
A    ext-src/tags/2.0.1RC3/tests/gmagick-008-addimage.phpt
A    ext-src/tags/2.0.1RC3/tests/gmagickdraw-015-settextdecoration_gettextdecoration.phpt
A    ext-src/tags/2.0.1RC3/tests/gmagick-058-getversion.phpt
A    ext-src/tags/2.0.1RC3/tests/gmagickdraw-014-setstrokewidth_getstrokewidth.phpt
A    ext-src/tags/2.0.1RC3/tests/gmagick-036-set_getimagefilename.phpt
A    ext-src/tags/2.0.1RC3/tests/gmagick-046-set_getimagerresolution.phpt
A    ext-src/tags/2.0.1RC3/tests/gmagick-070-motionblurimage.phpt
A    ext-src/tags/2.0.1RC3/tests/gmagick-044-set_getimageredprimary.phpt
A    ext-src/tags/2.0.1RC3/tests/gmagick-037-set_getimagegamma.phpt
A    ext-src/tags/2.0.1RC3/tests/gmagick-011-charcoalimage.phpt
A    ext-src/tags/2.0.1RC3/tests/gmagickdraw-016-settextencoding_gettextencoding.phpt
A    ext-src/tags/2.0.1RC3/tests/gmagick-020-enhanceimage.phpt
A    ext-src/tags/2.0.1RC3/tests/gmagickdraw-017-line.phpt
A    ext-src/tags/2.0.1RC3/tests/gmagick-039-getimageheight.phpt
A    ext-src/tags/2.0.1RC3/config.w32
A    ext-src/tags/2.0.1RC3/LICENSE
A    ext-src/tags/2.0.1RC3/tests/gmagick-010-borderimage.phpt
A    ext-src/tags/2.0.1RC3/tests/gmagick-009-addimagenoise.phpt
A    ext-src/branches/poc/tests/gmagickpixel-004-clone.phpt
A    ext-src/tags/2.0.1RC3/tests/gmagick-014-current.phpt
A    ext-src/tags/2.0.1RC3/tests/gmagickdraw-001-setstrokecolor_setstrokewidth.phpt
A    ext-src/branches/poc/tests/gmagick-013-commentimage.phpt
A    ext-src/tags/2.0.1RC3/tests/gmagick-003-resize_variations.phpt
A    ext-src/tags/2.0.1RC3/php_gmagick_macros.h
A    ext-src/branches/poc/tests/Vera.ttf
A    ext-src/tags/2.0.1RC3/tests/gmagick-042-set_getimageiterations.phpt
A    ext-src/tags/2.0.1RC3/gmagick_helpers.c
A    ext-src/branches/poc/php_gmagick.h
A    ext-src/branches/poc/tests/gmagick-073-profileimage.phpt
A    ext-src/branches/poc/tests/gmagickdraw-018-point.phpt
A    ext-src/branches/poc/tests/gmagick-055-getreleasedate.phpt
A    ext-src/branches/poc/tests/gmagick-069-trimimage.phpt
A    ext-src/branches/poc/tests/gmagick-081-separateimagechannel.phpt
A    ext-src/branches/poc/tests/gmagick-024-getcopyright_getfilename.phpt
A    ext-src/branches/poc/tests/gmagick-086-swirlimage.phpt
A    ext-src/branches/poc/tests/gmagick-052-getimagewidth.phpt
A    ext-src/branches/poc/tests/gmagickdraw-011-setfontweight_getfontweight.phpt
A    ext-src/branches/poc/gmagick_methods.c
A    ext-src/branches/poc/tests/gmagick-077-cropthumbnail.phpt
A    ext-src/branches/poc/tests/gmagickdraw-020-polyline.phpt
A    ext-src/branches/poc/tests/gmagickdraw-019-polygon.phpt
A    ext-src/branches/poc/tests/gmagickdraw-008-setfont_getfont.phpt
A    ext-src/branches/poc/tests/gmagickdraw-012-setstrokeopacity_getstrokeopacity.phpt
A    ext-src/branches/poc/tests/gmagick-043-set_getimageprofile.phpt
A    ext-src/branches/poc/tests/gmagick-075-quantizeimages.phpt
A    ext-src/branches/poc/tests/gmagickdraw-010-setfontstyle_getfontstyle.phpt
A    ext-src/branches/poc/tests/gmagick-002-crop_variations.phpt
A    ext-src/branches/poc/tests/gmagickdraw-022-rotate.phpt
A    ext-src/branches/poc/tests/gmagick-082-shearimage.phpt
A    ext-src/branches/poc/tests/gmagickdraw-007-setfillopacity_getfillopacity.phpt
A    ext-src/branches/poc/tests/gmagick-045-set_getimagerenderingintent.phpt
A    ext-src/branches/poc/tests/gmagick-017-destroy.phpt
A    ext-src/branches/poc/tests/gmagickdraw-009-setfontsize_getfontsize.phpt
A    ext-src/branches/poc/tests/gmagick-047-set_getimagescene.phpt
A    ext-src/branches/poc/tests/gmagickdraw-002-ellipse.phpt
A    ext-src/branches/poc/tests/gmagick-076-queryfonts.phpt
A    ext-src/branches/poc/tests/gmagick-054-getquantumdepth.phpt
A    ext-src/branches/poc/tests/gmagickdraw-013-setstrokecolor_getstrokecolor.phpt
A    ext-src/branches/poc/tests/gmagick-072-oilpaintimage.phpt
A    ext-src/branches/poc/tests/gmagick-056-set_getsamplingfactors.phpt
A    ext-src/branches/poc/tests/gmagick-005-draw.phpt
A    ext-src/branches/poc/tests/gmagick-034-set_getimagedispose.phpt
A    ext-src/branches/poc/tests/gmagick-041-set_getimageinterlacescheme.phpt
A    ext-src/branches/poc/tests/gmagickdraw-004-arc.phpt
A    ext-src/branches/poc/tests/gmagick-050-set_getimageunits.phpt
A    ext-src/branches/poc/tests/gmagick-023-gammaimage.phpt
A    ext-src/branches/poc/tests/gmagick-031-set_getimagecompose.phpt
A    ext-src/branches/poc/tests/gmagick-057-set_getsize.phpt
A    ext-src/branches/poc/tests/gmagick-059-hasnextimage.phpt
A    ext-src/branches/poc/tests/gmagick-012-chopimage.phpt
A    ext-src/branches/poc/tests/gmagick-062-labelimage.phpt
A    ext-src/branches/poc/tests/gmagick-019-embossimage.phpt
A    ext-src/branches/poc/tests/gmagick-035-set_getfilename.phpt
A    ext-src/branches/poc/tests/gmagick-040-getimagehistogram.phpt
A    ext-src/branches/poc/tests/gmagickpixel-003-getcolorcount.phpt
A    ext-src/branches/poc/tests/gmagick-049-set_getimagetype.phpt
A    ext-src/branches/poc/tests/gmagick-083-solarizeimage.phpt
A    ext-src/branches/poc/tests/gmagick-016-despeckleimage.phpt
A    ext-src/branches/poc/tests/gmagick-061-implodeimage.phpt
A    ext-src/branches/poc/tests/gmagick-048-getimagesignature.phpt
A    ext-src/branches/poc/tests/gmagick-074-quantizeimage.phpt
A    ext-src/branches/poc/tests/gmagick-051-set_getimagewhitepoint.phpt
A    ext-src/branches/poc/tests/gmagick-064-magnifyimage.phpt
A    ext-src/branches/poc/tests/gmagick-026-set_getimageblueprimary.phpt
A    ext-src/branches/poc/tests/gmagick-032-set_getimagedelay.phpt
A    ext-src/branches/poc/tests/gmagick-079-rotateimage.phpt
A    ext-src/branches/poc/tests/gmagick-007-blurimage.phpt
A    ext-src/branches/poc/tests/gmagick-006-annotateimage.phpt
A    ext-src/branches/poc/tests/gmagick-021-equalizeimage.phpt
A    ext-src/branches/poc/tests/gmagick-063-levelimage.phpt
A    ext-src/branches/poc/tests/gmagick-085-stripimage.phpt
A    ext-src/branches/poc/tests/gmagick-028-set_getimagechanneldepth.phpt
A    ext-src/branches/poc/tests/gmagick-033-set_getimagedepth.phpt
A    ext-src/branches/poc/tests/gmagickpixel-002-setcolorvalue_getcolorvalue.phpt
A    ext-src/branches/poc/tests/gmagick-029-set_getimagecolorspace.phpt
A    ext-src/branches/poc/tests/gmagick-078-rollimage.phpt
A    ext-src/branches/poc/tests/gmagickdraw-006-setfillcolor_getfillcolor.phpt
A    ext-src/branches/poc/tests/gmagick-065-mapimage.phpt
A    ext-src/branches/poc/tests/gmagickdraw-021-rectangle.phpt
A    ext-src/branches/poc/tests/gmagick-038-setimagegreenprimary.phpt
A    ext-src/branches/poc/tests/gmagickdraw-023-roundrectangle.phpt
A    ext-src/branches/poc/tests/gmagickdraw-003-annotate.phpt
A    ext-src/branches/poc/tests/gmagick-008-addimage.phpt
A    ext-src/branches/poc/tests/gmagick-027-set_getimagebordercolor.phpt
A    ext-src/branches/poc/tests/gmagick-084-spreadimage.phpt
A    ext-src/branches/poc/tests/gmagick-080-scaleimage.phpt
A    ext-src/branches/poc/tests/gmagick-068-modulateimage.phpt
A    ext-src/branches/poc/tests/gmagick-015-cyclecolormapimage.phpt
A    ext-src/branches/poc/tests/gmagick-004-composite_variations.phpt
A    ext-src/branches/poc/tests/gmagick-053-getpackagename.phpt
A    ext-src/branches/poc/tests/gmagick-022-flip_and_flop_image.phpt
A    ext-src/branches/poc/tests/gmagickdraw-015-settextdecoration_gettextdecoration.phpt
A    ext-src/branches/poc/tests/gmagick-001-read_and_write.phpt
A    ext-src/branches/poc/tests/gmagickdraw-024-scale.phpt
A    ext-src/branches/poc/tests/gmagick-060-haspreviousimage.phpt
A    ext-src/branches/poc/tests/gmagick-030-getimagecolors.phpt
A    ext-src/branches/poc/tests/gmagickdraw-005-bezier.phpt
A    ext-src/branches/poc/tests/gmagick-046-set_getimagerresolution.phpt
A    ext-src/branches/poc/tests/gmagick-025-set_and_getimageckgroundcolor.phpt
A    ext-src/branches/poc/tests/gmagick-011-charcoalimage.phpt
A    ext-src/branches/poc/tests/gmagickpixel-001-setcolor_getcolor.phpt
A    ext-src/branches/poc/tests/gmagick-067-minifyimage.phpt
A    ext-src/branches/poc/tests/gmagick-036-set_getimagefilename.phpt
A    ext-src/branches/poc/tests/gmagick-071-next_previousimage.phpt
A    ext-src/branches/poc/tests/gmagick-003-resize_variations.phpt
A    ext-src/branches/poc/tests/gmagick-018-edgeimage.phpt
A    ext-src/branches/poc/tests/gmagick-037-set_getimagegamma.phpt
A    ext-src/branches/poc/tests/gmagickdraw-014-setstrokewidth_getstrokewidth.phpt
A    ext-src/branches/poc/tests/gmagick-042-set_getimageiterations.phpt
A    ext-src/branches/poc/tests/gmagick-066-medianfilterimage.phpt
A    ext-src/branches/poc/tests/gmagickdraw-017-line.phpt
A    ext-src/branches/poc/tests/gmagick-044-set_getimageredprimary.phpt
A    ext-src/branches/poc/package.xml
A    ext-src/branches/poc/tests/gmagick-014-current.phpt
A    ext-src/branches/poc/tests/gmagick-010-borderimage.phpt
A    ext-src/branches/poc/tests/gmagick-020-enhanceimage.phpt
A    ext-src/branches/poc/LICENSE
A    ext-src/branches/poc/tests/gmagick-009-addimagenoise.phpt
A    ext-src/branches/poc/tests/gmagick-039-getimageheight.phpt
A    ext-src/branches/poc/php_gmagick_macros.h
A    ext-src/branches/poc/php_gmagick_helpers.h
A    ext-src/branches/poc/tests/gmagick-058-getversion.phpt
A    ext-src/branches/poc/tests/gmagickdraw-001-setstrokecolor_setstrokewidth.phpt
A    ext-src/branches/poc/config.w32
A    ext-src/branches/poc/tests/gmagick-070-motionblurimage.phpt
A    ext-src/branches/poc/gmagick.c
A    ext-src/branches/poc/gmagickpixel_methods.c
A    ext-src/branches/poc/tests/gmagickdraw-016-settextencoding_gettextencoding.phpt
A    ext-src/branches/poc/gmagickdraw_methods.c
A    ext-src/branches/poc/config.m4
A    ext-src/branches/poc/gmagick_helpers.c
A    ext-src/branches/poc/README
Checked out revision 352313.
Configuring for:
PHP Api Version:         20190902
Zend Module Api No:      20190902
Zend Extension Api No:   320190902
checking for grep that handles long lines and -e...
/bin/grep
checking for egrep...
/bin/grep -E
checking for a sed that does not truncate output...
/bin/sed
checking for pkg-config...
/usr/bin/pkg-config
checking pkg-config is at least version 0.9.0...
yes
checking for cc...
cc
checking whether the C compiler works...
yes
checking for C compiler default output file name...
a.out
checking for suffix of executables...
checking whether we are cross compiling...
no
checking for suffix of object files...
o
checking whether we are using the GNU C compiler...
yes
checking whether cc accepts -g...
yes
checking for cc option to accept ISO C89...
none needed
checking how to run the C preprocessor...
cc -E
checking for icc...
no
checking for suncc...
no
checking for system library directory...
lib
checking if compiler supports -R...
no
checking if compiler supports -Wl,-rpath,...
yes
checking build system type...
x86_64-pc-linux-gnu
checking host system type...
x86_64-pc-linux-gnu
checking target system type...
x86_64-pc-linux-gnu
checking for PHP prefix...
/usr/local
checking for PHP includes...
-I/usr/local/include/php -I/usr/local/include/php/main -I/usr/local/include/php/TSRM -I/usr/local/include/php/Zend -I/usr/local/include/php/ext -I/usr/local/include/php/ext/date/lib
checking for PHP extension directory...
/usr/local/lib/php/extensions/no-debug-non-zts-20190902
checking for PHP installed headers prefix...
/usr/local/include/php
checking if debug is enabled...
no
checking if zts is enabled...
no
checking for gawk...
no
checking for nawk...
nawk
checking if nawk is broken...
no
checking whether to enable the gmagick extension...
yes, shared
checking GraphicsMagick configuration program...
found in /usr/bin/GraphicsMagick-config
checking GraphicsMagick version...
found version 1.3.35
checking GraphicsMagick version mask...
found version 1003035
checking for a sed that does not truncate output...
/bin/sed
checking for ld used by cc...
/usr/bin/ld
checking if the linker (/usr/bin/ld) is GNU ld...
yes
checking for /usr/bin/ld option to reload object files...
-r
checking for BSD-compatible nm...
/usr/bin/nm -B
checking whether ln -s works...
yes
checking how to recognize dependent libraries...
pass_all
checking for ANSI C header files...
yes
checking for sys/types.h...
yes
checking for sys/stat.h...
yes
checking for stdlib.h...
yes
checking for string.h...
yes
checking for memory.h...
yes
checking for strings.h...
yes
checking for inttypes.h...
yes
checking for stdint.h...
yes
checking for unistd.h...
yes
checking dlfcn.h usability...
yes
checking dlfcn.h presence...
yes
checking for dlfcn.h...
yes
checking the maximum length of command line arguments...
1572864
checking command to parse /usr/bin/nm -B output from cc object...
ok
checking for objdir...
.libs
checking for ar...
ar
checking for ranlib...
ranlib
checking for strip...
strip
checking if cc supports -fno-rtti -fno-exceptions...
no
checking for cc option to produce PIC...
-fPIC
checking if cc PIC flag -fPIC works...
yes
checking if cc static flag -static works...
yes
checking if cc supports -c -o file.o...
yes
checking whether the cc linker (/usr/bin/ld -m elf_x86_64) supports shared libraries...
yes
checking whether -lc should be explicitly linked in...
no
checking dynamic linker characteristics...
GNU/Linux ld.so
checking how to hardcode library paths into programs...
immediate
checking whether stripping libraries is possible...
yes
checking if libtool supports shared libraries...
yes
checking whether to build shared libraries...
yes
checking whether to build static libraries...
no
creating libtool
appending configuration tag "CXX" to libtool
configure: patching config.h.in
configure: creating ./config.status
config.status: creating config.h
/bin/bash /tmp/ext-src/trunk/libtool --mode=compile cc  -I. -I/tmp/ext-src/trunk -DPHP_ATOM_INC -I/tmp/ext-src/trunk/include -I/tmp/ext-src/trunk/main -I/tmp/ext-src/trunk -I/usr/local/include/php -I/usr/local/include/php/main -I/usr/local/include/php/TSRM -I/usr/local/include/php/Zend -I/usr/local/include/php/ext -I/usr/local/include/php/ext/date/lib -I/usr/include/GraphicsMagick  -DHAVE_CONFIG_H  -g -O2   -c /tmp/ext-src/trunk/gmagick_helpers.c -o gmagick_helpers.lo
mkdir .libs
cc -I. -I/tmp/ext-src/trunk -DPHP_ATOM_INC -I/tmp/ext-src/trunk/include -I/tmp/ext-src/trunk/main -I/tmp/ext-src/trunk -I/usr/local/include/php -I/usr/local/include/php/main -I/usr/local/include/php/TSRM -I/usr/local/include/php/Zend -I/usr/local/include/php/ext -I/usr/local/include/php/ext/date/lib -I/usr/include/GraphicsMagick -DHAVE_CONFIG_H -g -O2 -c /tmp/ext-src/trunk/gmagick_helpers.c  -fPIC -DPIC -o .libs/gmagick_helpers.o
/bin/bash /tmp/ext-src/trunk/libtool --mode=compile cc  -I. -I/tmp/ext-src/trunk -DPHP_ATOM_INC -I/tmp/ext-src/trunk/include -I/tmp/ext-src/trunk/main -I/tmp/ext-src/trunk -I/usr/local/include/php -I/usr/local/include/php/main -I/usr/local/include/php/TSRM -I/usr/local/include/php/Zend -I/usr/local/include/php/ext -I/usr/local/include/php/ext/date/lib -I/usr/include/GraphicsMagick  -DHAVE_CONFIG_H  -g -O2   -c /tmp/ext-src/trunk/gmagick_methods.c -o gmagick_methods.lo
cc -I. -I/tmp/ext-src/trunk -DPHP_ATOM_INC -I/tmp/ext-src/trunk/include -I/tmp/ext-src/trunk/main -I/tmp/ext-src/trunk -I/usr/local/include/php -I/usr/local/include/php/main -I/usr/local/include/php/TSRM -I/usr/local/include/php/Zend -I/usr/local/include/php/ext -I/usr/local/include/php/ext/date/lib -I/usr/include/GraphicsMagick -DHAVE_CONFIG_H -g -O2 -c /tmp/ext-src/trunk/gmagick_methods.c  -fPIC -DPIC -o .libs/gmagick_methods.o
/bin/bash /tmp/ext-src/trunk/libtool --mode=compile cc  -I. -I/tmp/ext-src/trunk -DPHP_ATOM_INC -I/tmp/ext-src/trunk/include -I/tmp/ext-src/trunk/main -I/tmp/ext-src/trunk -I/usr/local/include/php -I/usr/local/include/php/main -I/usr/local/include/php/TSRM -I/usr/local/include/php/Zend -I/usr/local/include/php/ext -I/usr/local/include/php/ext/date/lib -I/usr/include/GraphicsMagick  -DHAVE_CONFIG_H  -g -O2   -c /tmp/ext-src/trunk/gmagick.c -o gmagick.lo
cc -I. -I/tmp/ext-src/trunk -DPHP_ATOM_INC -I/tmp/ext-src/trunk/include -I/tmp/ext-src/trunk/main -I/tmp/ext-src/trunk -I/usr/local/include/php -I/usr/local/include/php/main -I/usr/local/include/php/TSRM -I/usr/local/include/php/Zend -I/usr/local/include/php/ext -I/usr/local/include/php/ext/date/lib -I/usr/include/GraphicsMagick -DHAVE_CONFIG_H -g -O2 -c /tmp/ext-src/trunk/gmagick.c  -fPIC -DPIC -o .libs/gmagick.o
/bin/bash /tmp/ext-src/trunk/libtool --mode=compile cc  -I. -I/tmp/ext-src/trunk -DPHP_ATOM_INC -I/tmp/ext-src/trunk/include -I/tmp/ext-src/trunk/main -I/tmp/ext-src/trunk -I/usr/local/include/php -I/usr/local/include/php/main -I/usr/local/include/php/TSRM -I/usr/local/include/php/Zend -I/usr/local/include/php/ext -I/usr/local/include/php/ext/date/lib -I/usr/include/GraphicsMagick  -DHAVE_CONFIG_H  -g -O2   -c /tmp/ext-src/trunk/gmagickdraw_methods.c -o gmagickdraw_methods.lo
cc -I. -I/tmp/ext-src/trunk -DPHP_ATOM_INC -I/tmp/ext-src/trunk/include -I/tmp/ext-src/trunk/main -I/tmp/ext-src/trunk -I/usr/local/include/php -I/usr/local/include/php/main -I/usr/local/include/php/TSRM -I/usr/local/include/php/Zend -I/usr/local/include/php/ext -I/usr/local/include/php/ext/date/lib -I/usr/include/GraphicsMagick -DHAVE_CONFIG_H -g -O2 -c /tmp/ext-src/trunk/gmagickdraw_methods.c  -fPIC -DPIC -o .libs/gmagickdraw_methods.o
/bin/bash /tmp/ext-src/trunk/libtool --mode=compile cc  -I. -I/tmp/ext-src/trunk -DPHP_ATOM_INC -I/tmp/ext-src/trunk/include -I/tmp/ext-src/trunk/main -I/tmp/ext-src/trunk -I/usr/local/include/php -I/usr/local/include/php/main -I/usr/local/include/php/TSRM -I/usr/local/include/php/Zend -I/usr/local/include/php/ext -I/usr/local/include/php/ext/date/lib -I/usr/include/GraphicsMagick  -DHAVE_CONFIG_H  -g -O2   -c /tmp/ext-src/trunk/gmagickpixel_methods.c -o gmagickpixel_methods.lo
cc -I. -I/tmp/ext-src/trunk -DPHP_ATOM_INC -I/tmp/ext-src/trunk/include -I/tmp/ext-src/trunk/main -I/tmp/ext-src/trunk -I/usr/local/include/php -I/usr/local/include/php/main -I/usr/local/include/php/TSRM -I/usr/local/include/php/Zend -I/usr/local/include/php/ext -I/usr/local/include/php/ext/date/lib -I/usr/include/GraphicsMagick -DHAVE_CONFIG_H -g -O2 -c /tmp/ext-src/trunk/gmagickpixel_methods.c  -fPIC -DPIC -o .libs/gmagickpixel_methods.o
/bin/bash /tmp/ext-src/trunk/libtool --mode=link cc -DPHP_ATOM_INC -I/tmp/ext-src/trunk/include -I/tmp/ext-src/trunk/main -I/tmp/ext-src/trunk -I/usr/local/include/php -I/usr/local/include/php/main -I/usr/local/include/php/TSRM -I/usr/local/include/php/Zend -I/usr/local/include/php/ext -I/usr/local/include/php/ext/date/lib -I/usr/include/GraphicsMagick  -DHAVE_CONFIG_H  -g -O2    -o gmagick.la -export-dynamic -avoid-version -prefer-pic -module -rpath /tmp/ext-src/trunk/modules  gmagick_helpers.lo gmagick_methods.lo gmagick.lo gmagickdraw_methods.lo gmagickpixel_methods.lo -lGraphicsMagickWand -lGraphicsMagick
cc -shared  .libs/gmagick_helpers.o .libs/gmagick_methods.o .libs/gmagick.o .libs/gmagickdraw_methods.o .libs/gmagickpixel_methods.o  -lGraphicsMagickWand -lGraphicsMagick  -Wl,-soname -Wl,gmagick.so -o .libs/gmagick.so
creating gmagick.la
(cd .libs && rm -f gmagick.la && ln -s ../gmagick.la gmagick.la)
/bin/bash /tmp/ext-src/trunk/libtool --mode=install cp ./gmagick.la /tmp/ext-src/trunk/modules
cp ./.libs/gmagick.so /tmp/ext-src/trunk/modules/gmagick.so
cp ./.libs/gmagick.lai /tmp/ext-src/trunk/modules/gmagick.la
PATH="$PATH:/sbin" ldconfig -n /tmp/ext-src/trunk/modules
----------------------------------------------------------------------
Libraries have been installed in:
/tmp/ext-src/trunk/modules
If you ever happen to want to link against installed libraries
in a given directory, LIBDIR, you must either use libtool, and
specify the full pathname of the library, or use the `-LLIBDIR'
flag during linking and do at least one of the following:
- add LIBDIR to the `LD_LIBRARY_PATH' environment variable
during execution
- add LIBDIR to the `LD_RUN_PATH' environment variable
during linking
- use the `-Wl,--rpath -Wl,LIBDIR' linker flag
- have your system administrator add LIBDIR to `/etc/ld.so.conf'
See any operating system documentation about shared libraries for
more information, such as the ld(1) and ld.so(8) manual pages.
----------------------------------------------------------------------
Build complete.
Don't forget to run 'make test'.
Build complete.
Don't forget to run 'make test'.
=====================================================================
PHP         : /usr/local/bin/php 
PHP_SAPI    : cli
PHP_VERSION : 7.4.16
ZEND_VERSION: 3.4.0
PHP_OS      : Linux - Linux f5d8c528ebe9 5.8.0-44-generic #50-Ubuntu SMP Tue Feb 9 06:29:41 UTC 2021 x86_64
INI actual  : /tmp/ext-src/trunk/tmp-php.ini
More .INIs  :   
---------------------------------------------------------------------
PHP         : /usr/local/bin/phpdbg 
PHP_SAPI    : phpdbg
PHP_VERSION : 7.4.16
ZEND_VERSION: 3.4.0
PHP_OS      : Linux - Linux f5d8c528ebe9 5.8.0-44-generic #50-Ubuntu SMP Tue Feb 9 06:29:41 UTC 2021 x86_64
INI actual  : /tmp/ext-src/trunk/tmp-php.ini
More .INIs  : 
---------------------------------------------------------------------
CWD         : /tmp/ext-src/trunk
Extra dirs  :
VALGRIND    : Not used
=====================================================================
TIME START 2021-03-08 19:32:18
=====================================================================
TEST 1/183 [tests/gmagick-001-read_and_write.phpt]
PASS Test read/write [tests/gmagick-001-read_and_write.phpt]
TEST 2/183 [tests/gmagick-002-crop_variations.phpt]
PASS Test crop with and without an image [tests/gmagick-002-crop_variations.phpt]
TEST 3/183 [tests/gmagick-003-resize_variations.phpt]
PASS Test resize [tests/gmagick-003-resize_variations.phpt]
TEST 4/183 [tests/gmagick-004-composite_variations.phpt]
PASS Test composite variations [tests/gmagick-004-composite_variations.phpt]
TEST 5/183 [tests/gmagick-005-draw.phpt]
PASS Test read/write [tests/gmagick-005-draw.phpt] 
TEST 6/183 [tests/gmagick-006-annotateimage.phpt]
FAIL Test annotate image [tests/gmagick-006-annotateimage.phpt]
TEST 7/183 [tests/gmagick-007-blurimage.phpt]
PASS Test blur image [tests/gmagick-007-blurimage.phpt]
TEST 8/183 [tests/gmagick-008-addimage.phpt]
PASS Test add image [tests/gmagick-008-addimage.phpt]
TEST 9/183 [tests/gmagick-009-addimagenoise.phpt]
PASS Test addnoiseimage image [tests/gmagick-009-addimagenoise.phpt]
TEST 10/183 [tests/gmagick-010-borderimage.phpt]
PASS Test border image [tests/gmagick-010-borderimage.phpt]
TEST 11/183 [tests/gmagick-011-charcoalimage.phpt]
PASS Test charcoal image [tests/gmagick-011-charcoalimage.phpt]
TEST 12/183 [tests/gmagick-012-chopimage.phpt]
PASS Test chop image [tests/gmagick-012-chopimage.phpt]
TEST 13/183 [tests/gmagick-013-commentimage.phpt]
PASS Test commentImage [tests/gmagick-013-commentimage.phpt]
TEST 14/183 [tests/gmagick-014-current.phpt]
PASS Test current [tests/gmagick-014-current.phpt]
TEST 15/183 [tests/gmagick-015-cyclecolormapimage.phpt]
PASS Test current [tests/gmagick-015-cyclecolormapimage.phpt]
TEST 16/183 [tests/gmagick-016-despeckleimage.phpt]
PASS Despeckle image [tests/gmagick-016-despeckleimage.phpt]
TEST 17/183 [tests/gmagick-017-destroy.phpt]
PASS Destroy [tests/gmagick-017-destroy.phpt]
TEST 18/183 [tests/gmagick-018-edgeimage.phpt]
PASS Edge [tests/gmagick-018-edgeimage.phpt]
TEST 19/183 [tests/gmagick-019-embossimage.phpt]
PASS Emboss [tests/gmagick-019-embossimage.phpt]
TEST 20/183 [tests/gmagick-020-enhanceimage.phpt]
PASS Enhance [tests/gmagick-020-enhanceimage.phpt]
TEST 21/183 [tests/gmagick-021-equalizeimage.phpt]
PASS Equalize [tests/gmagick-021-equalizeimage.phpt]
TEST 22/183 [tests/gmagick-022-flip_and_flop_image.phpt]
PASS Flip and flop image [tests/gmagick-022-flip_and_flop_image.phpt]
TEST 23/183 [tests/gmagick-023-gammaimage.phpt]
PASS Gamma image [tests/gmagick-023-gammaimage.phpt]
TEST 24/183 [tests/gmagick-024-getcopyright_getfilename.phpt]
PASS Test getCopyright, getFileName [tests/gmagick-024-getcopyright_getfilename.phpt]
TEST 25/183 [tests/gmagick-025-set_and_getimageckgroundcolor.phpt]
SKIP Test setImageBackgroundColor and getImageBackgroundColor methods [tests/gmagick-025-set_and_getimageckgroundcolor.phpt] reason: QUANTUM_DEPTH=16
TEST 26/183 [tests/gmagick-025-set_and_getimageckgroundcolor_q16.phpt]
PASS Test setImageBackgroundColor and getImageBackgroundColor methods [tests/gmagick-025-set_and_getimageckgroundcolor_q16.phpt]
TEST 27/183 [tests/gmagick-026-set_getimageblueprimary.phpt]
PASS Set, get imageblueprimary test [tests/gmagick-026-set_getimageblueprimary.phpt]
TEST 28/183 [tests/gmagick-027-set_getimagebordercolor.phpt]
SKIP Imagebordercolor test [tests/gmagick-027-set_getimagebordercolor.phpt] reason: QUANTUM_DEPTH=16
TEST 29/183 [tests/gmagick-027-set_getimagebordercolor_q16.phpt]
PASS Imagebordercolor test [tests/gmagick-027-set_getimagebordercolor_q16.phpt]
TEST 30/183 [tests/gmagick-028-set_getimagechanneldepth.phpt]
PASS Set, get imagechanneldepth test [tests/gmagick-028-set_getimagechanneldepth.phpt]
TEST 31/183 [tests/gmagick-029-set_getimagecolorspace.phpt]
PASS Set, get imagecolorspace test [tests/gmagick-029-set_getimagecolorspace.phpt]
TEST 32/183 [tests/gmagick-030-getimagecolors.phpt]
PASS Getimagecolors test [tests/gmagick-030-getimagecolors.phpt]
TEST 33/183 [tests/gmagick-031-set_getimagecompose.phpt]
PASS Set and get image compose [tests/gmagick-031-set_getimagecompose.phpt]
TEST 34/183 [tests/gmagick-032-set_getimagedelay.phpt]
PASS Set, getimagedelay test [tests/gmagick-032-set_getimagedelay.phpt]
TEST 35/183 [tests/gmagick-033-set_getimagedepth.phpt]
PASS Set, getimagedepth [tests/gmagick-033-set_getimagedepth.phpt]
TEST 36/183 [tests/gmagick-034-set_getimagedispose.phpt]
PASS Set, getimagedepth [tests/gmagick-034-set_getimagedispose.phpt]
TEST 37/183 [tests/gmagick-035-set_getfilename.phpt]
PASS Set, get filename [tests/gmagick-035-set_getfilename.phpt]
TEST 38/183 [tests/gmagick-036-set_getimagefilename.phpt]
PASS Set, get imagefilename [tests/gmagick-036-set_getimagefilename.phpt]
TEST 39/183 [tests/gmagick-037-set_getimagegamma.phpt]
PASS Set, get image gamma [tests/gmagick-037-set_getimagegamma.phpt]
TEST 40/183 [tests/gmagick-038-setimagegreenprimary.phpt]
PASS Set, get imagegreenprimary [tests/gmagick-038-setimagegreenprimary.phpt]
TEST 41/183 [tests/gmagick-039-getimageheight.phpt]
PASS Set, get image height [tests/gmagick-039-getimageheight.phpt]
TEST 42/183 [tests/gmagick-040-getimagehistogram.phpt]
PASS Set, get image histogram [tests/gmagick-040-getimagehistogram.phpt]
TEST 43/183 [tests/gmagick-041-set_getimageinterlacescheme.phpt]
PASS Set, get image interlace scheme [tests/gmagick-041-set_getimageinterlacescheme.phpt]
TEST 44/183 [tests/gmagick-042-set_getimageiterations.phpt]
PASS Set, get image iterations [tests/gmagick-042-set_getimageiterations.phpt]
TEST 45/183 [tests/gmagick-043-set_getimageprofile.phpt]
PASS Set, get imageprofile [tests/gmagick-043-set_getimageprofile.phpt]
TEST 46/183 [tests/gmagick-044-set_getimageredprimary.phpt]
PASS Set, get imageredprimary [tests/gmagick-044-set_getimageredprimary.phpt]
TEST 47/183 [tests/gmagick-045-set_getimagerenderingintent.phpt]
PASS Set, get imagerenderingintent [tests/gmagick-045-set_getimagerenderingintent.phpt]
TEST 48/183 [tests/gmagick-046-set_getimagerresolution.phpt]
PASS Set, get imageresolution [tests/gmagick-046-set_getimagerresolution.phpt]
TEST 49/183 [tests/gmagick-047-set_getimagescene.phpt]
PASS Set, get imagescene [tests/gmagick-047-set_getimagescene.phpt]
TEST 50/183 [tests/gmagick-048-getimagesignature.phpt]
PASS Set, get imagesignature [tests/gmagick-048-getimagesignature.phpt]
TEST 51/183 [tests/gmagick-049-set_getimagetype.phpt]
PASS Set, get imagetype [tests/gmagick-049-set_getimagetype.phpt]
TEST 52/183 [tests/gmagick-050-set_getimageunits.phpt]
PASS Set, get imageunits [tests/gmagick-050-set_getimageunits.phpt]
TEST 53/183 [tests/gmagick-051-set_getimagewhitepoint.phpt]
PASS Set, get imagewhitepoint [tests/gmagick-051-set_getimagewhitepoint.phpt]
TEST 54/183 [tests/gmagick-052-getimagewidth.phpt]
PASS get imagewidth [tests/gmagick-052-getimagewidth.phpt]
TEST 55/183 [tests/gmagick-053-getpackagename.phpt]
PASS get packagename [tests/gmagick-053-getpackagename.phpt]
TEST 56/183 [tests/gmagick-054-getquantumdepth.phpt]
PASS get quantumdepth [tests/gmagick-054-getquantumdepth.phpt]
TEST 57/183 [tests/gmagick-055-getreleasedate.phpt]
PASS get releasedate [tests/gmagick-055-getreleasedate.phpt]
TEST 58/183 [tests/gmagick-056-set_getsamplingfactors.phpt]
PASS Set, getsamplingfactors [tests/gmagick-056-set_getsamplingfactors.phpt]
TEST 59/183 [tests/gmagick-057-set_getsize.phpt]
PASS set,get size test [tests/gmagick-057-set_getsize.phpt]
TEST 60/183 [tests/gmagick-058-getversion.phpt]
PASS getVersion test [tests/gmagick-058-getversion.phpt]
TEST 61/183 [tests/gmagick-059-hasnextimage.phpt]
PASS hasNextImage test [tests/gmagick-059-hasnextimage.phpt]
TEST 62/183 [tests/gmagick-060-haspreviousimage.phpt]
PASS hasPreviousImage test [tests/gmagick-060-haspreviousimage.phpt]
TEST 63/183 [tests/gmagick-061-implodeimage.phpt]
PASS implode image test [tests/gmagick-061-implodeimage.phpt]
TEST 64/183 [tests/gmagick-062-labelimage.phpt]
PASS labelImage test [tests/gmagick-062-labelimage.phpt]
TEST 65/183 [tests/gmagick-063-levelimage.phpt]
PASS levelImage test [tests/gmagick-063-levelimage.phpt]
TEST 66/183 [tests/gmagick-064-magnifyimage.phpt]
PASS magnifyImage test [tests/gmagick-064-magnifyimage.phpt]
TEST 67/183 [tests/gmagick-065-mapimage.phpt]
PASS mapImage test [tests/gmagick-065-mapimage.phpt]
TEST 68/183 [tests/gmagick-066-medianfilterimage.phpt]
PASS medianFilterImage test [tests/gmagick-066-medianfilterimage.phpt]
TEST 69/183 [tests/gmagick-067-minifyimage.phpt]
PASS minifyImage test [tests/gmagick-067-minifyimage.phpt]
TEST 70/183 [tests/gmagick-068-modulateimage.phpt]
PASS modulateImage test [tests/gmagick-068-modulateimage.phpt]
TEST 71/183 [tests/gmagick-069-trimimage.phpt]
PASS trimImage test [tests/gmagick-069-trimimage.phpt]
TEST 72/183 [tests/gmagick-070-motionblurimage.phpt]
PASS motionblur test [tests/gmagick-070-motionblurimage.phpt]
TEST 73/183 [tests/gmagick-071-next_previousimage.phpt]
PASS next,previousImage test [tests/gmagick-071-next_previousimage.phpt]
TEST 74/183 [tests/gmagick-072-oilpaintimage.phpt]
PASS oilPaintImage test [tests/gmagick-072-oilpaintimage.phpt]
TEST 75/183 [tests/gmagick-073-profileimage.phpt]
PASS profileImage test [tests/gmagick-073-profileimage.phpt]
TEST 76/183 [tests/gmagick-074-quantizeimage.phpt]
PASS quantizeImage test [tests/gmagick-074-quantizeimage.phpt]
TEST 77/183 [tests/gmagick-075-quantizeimages.phpt]
PASS quantizeImages test [tests/gmagick-075-quantizeimages.phpt]
TEST 78/183 [tests/gmagick-076-queryfonts.phpt]
PASS queryFonts test [tests/gmagick-076-queryfonts.phpt]
TEST 79/183 [tests/gmagick-077-cropthumbnail.phpt]
PASS cropthumbnail test [tests/gmagick-077-cropthumbnail.phpt]
TEST 80/183 [tests/gmagick-078-rollimage.phpt]
PASS rollImage test [tests/gmagick-078-rollimage.phpt]
TEST 81/183 [tests/gmagick-079-rotateimage.phpt]
PASS rotateImage test [tests/gmagick-079-rotateimage.phpt]
TEST 82/183 [tests/gmagick-080-scaleimage.phpt]
PASS scaleImage test [tests/gmagick-080-scaleimage.phpt]
TEST 83/183 [tests/gmagick-081-separateimagechannel.phpt]
PASS separateImageChannel test [tests/gmagick-081-separateimagechannel.phpt]
TEST 84/183 [tests/gmagick-082-shearimage.phpt]
PASS shearImage test [tests/gmagick-082-shearimage.phpt]
TEST 85/183 [tests/gmagick-083-solarizeimage.phpt]
PASS solarizeImage test [tests/gmagick-083-solarizeimage.phpt]
TEST 86/183 [tests/gmagick-084-spreadimage.phpt]
PASS spreadImage test [tests/gmagick-084-spreadimage.phpt]
TEST 87/183 [tests/gmagick-085-stripimage.phpt]
PASS stripImage test [tests/gmagick-085-stripimage.phpt]
TEST 88/183 [tests/gmagick-086-swirlimage.phpt]
PASS swirlImage test [tests/gmagick-086-swirlimage.phpt]
TEST 89/183 [tests/gmagick-087-setcompressionquality.phpt]
PASS setCompressionQuality test [tests/gmagick-087-setcompressionquality.phpt]
TEST 90/183 [tests/gmagick-088-getimageblob.phpt]
PASS getimageBlob test [tests/gmagick-088-getimageblob.phpt]
TEST 91/183 [tests/gmagick-089-getnumberimages.phpt]
PASS getNumberImages test [tests/gmagick-089-getnumberimages.phpt]
TEST 92/183 [tests/gmagick-090-setimage.phpt]
PASS setImage test [tests/gmagick-090-setimage.phpt]
TEST 93/183 [tests/gmagick-091-getimage.phpt]
PASS getImage test [tests/gmagick-091-getimage.phpt]
TEST 94/183 [tests/gmagick-092-getimagegeometry.phpt]
PASS setImage test [tests/gmagick-092-getimagegeometry.phpt]
TEST 95/183 [tests/gmagick-093-flattenimages.phpt]
PASS setImage test [tests/gmagick-093-flattenimages.phpt]
TEST 96/183 [tests/gmagick-094-thresholdimage.phpt]
PASS thresholdImage test [tests/gmagick-094-thresholdimage.phpt]
TEST 97/183 [tests/gmagick-095-negateimage.phpt]
PASS negateImage test [tests/gmagick-095-negateimage.phpt]
TEST 98/183 [tests/gmagick-096-setinterlacescheme.phpt]
PASS setInterlaceScheme test [tests/gmagick-096-setinterlacescheme.phpt]
TEST 99/183 [tests/gmagick-097-sampleimage.phpt]
PASS sampleimage test [tests/gmagick-097-sampleimage.phpt]
TEST 100/183 [tests/gmagick-098-cloneimage.phpt]
PASS cloneimage test [tests/gmagick-098-cloneimage.phpt]
TEST 101/183 [tests/gmagick-099-appendimages.phpt]
PASS appendimages test [tests/gmagick-099-appendimages.phpt]
TEST 102/183 [tests/gmagick-100-coalesceimages.phpt]
PASS coalesceimages test [tests/gmagick-100-coalesceimages.phpt]
TEST 103/183 [tests/gmagick-101-sharpenimage.phpt]
PASS sharpenimage test [tests/gmagick-101-sharpenimage.phpt]
TEST 104/183 [tests/gmagick-102-unsharpenmaskimage.phpt]
PASS unsharpmaskimage test [tests/gmagick-102-unsharpenmaskimage.phpt]
TEST 105/183 [tests/gmagick-103-setgetimagecompression.phpt]
PASS setImageCompression test [tests/gmagick-103-setgetimagecompression.phpt]
TEST 106/183 [tests/gmagick-104-setgetimagepage.phpt]
PASS Gmagick::setImagePage test [tests/gmagick-104-setgetimagepage.phpt]
TEST 107/183 [tests/gmagick-105-readimageblob.phpt]
PASS Gmagick::readImageBlob [tests/gmagick-105-readimageblob.phpt]
TEST 108/183 [tests/gmagick-106-testConstants.phpt]
PASS Test contants have symbols. [tests/gmagick-106-testConstants.phpt]
TEST 109/183 [tests/gmagick-107_setimagevirtualpixelmethod.phpt]
PASS Test Tutorial, edgeExtend [tests/gmagick-107_setimagevirtualpixelmethod.phpt]
TEST 110/183 [tests/gmagick-108_adaptiveThresholdImage_basic.phpt]
PASS Test Gmagick, adaptiveThresholdImage [tests/gmagick-108_adaptiveThresholdImage_basic.phpt]
TEST 111/183 [tests/gmagick-109_affineTransformImage_basic.phpt]
PASS Test Gmagick, affineTransformImage [tests/gmagick-109_affineTransformImage_basic.phpt]
TEST 112/183 [tests/gmagick-110_blackThresholdImage_basic.phpt]
PASS Test Gmagick, blackThresholdImage [tests/gmagick-110_blackThresholdImage_basic.phpt]
TEST 113/183 [tests/gmagick-111_whiteThresholdImage_basic.phpt]
PASS Test Gmagick, whiteThresholdImage [tests/gmagick-111_whiteThresholdImage_basic.phpt]
TEST 114/183 [tests/gmagick-112_colorizeImage_basic.phpt]
PASS Test Gmagick, colorizeImage [tests/gmagick-112_colorizeImage_basic.phpt]
TEST 115/183 [tests/gmagick-113_compareImages.phpt]
PASS Test PHP bug #59378 writing to php://memory is incomplete [tests/gmagick-113_compareImages.phpt]
TEST 116/183 [tests/gmagick-114_convolveImage_6.phpt]
PASS Test Gmagick, convolveImage [tests/gmagick-114_convolveImage_6.phpt]
TEST 117/183 [tests/gmagick-115_equalizeImage_case2.phpt]
PASS Test Gmagick, equalizeImage [tests/gmagick-115_equalizeImage_case2.phpt]
TEST 118/183 [tests/gmagick-116_waveImage_basic.phpt]
PASS Test Gmagick, waveImage [tests/gmagick-116_waveImage_basic.phpt]
TEST 119/183 [tests/gmagick-117_haldClutImage_basic.phpt]
PASS Test Gmagick, haldClutImage [tests/gmagick-117_haldClutImage_basic.phpt]
TEST 120/183 [tests/gmagick-118_shaveImage_basic.phpt]
PASS Test Gmagick, shaveImage [tests/gmagick-118_shaveImage_basic.phpt]
TEST 121/183 [tests/gmagick-119_thumbnail_fill.phpt]
PASS Test filling thumbnail with color [tests/gmagick-119_thumbnail_fill.phpt]
TEST 122/183 [tests/gmagick-120_writeImageFile.phpt]
PASS Test PHP writing to php://memory [tests/gmagick-120_writeImageFile.phpt]
TEST 123/183 [tests/gmagick-121_deconstructGif_basic.phpt]
XFAIL Test Tutorial, deconstructGif [tests/gmagick-121_deconstructGif_basic.phpt]   XFAIL REASON: GraphicMagick has multiple issues with 'image counts'. It appears to be confused how many images are in the list.
TEST 124/183 [tests/gmagick-122_unsharpMaskImage_basic.phpt]
PASS Test Gmagick, unsharpMaskImage [tests/gmagick-122_unsharpMaskImage_basic.phpt]
TEST 125/183 [tests/gmagick-123_sharpenImage_basic.phpt]
PASS Test Gmagick, sharpenImage [tests/gmagick-123_sharpenImage_basic.phpt]
TEST 126/183 [tests/gmagick-124__reduceNoiseImage_basic.phpt]
PASS Test Gmagick, reduceNoiseImage [tests/gmagick-124__reduceNoiseImage_basic.phpt]
TEST 127/183 [tests/gmagick-125_radialBlurImage_basic.phpt]
SKIP Test Gmagick, radialBlurImage [tests/gmagick-125_radialBlurImage_basic.phpt] reason: - not implemented by GraphicsMagick
TEST 128/183 [tests/gmagick-126_negateImage_basic.phpt]
PASS Test Gmagick, negateImage [tests/gmagick-126_negateImage_basic.phpt]
TEST 129/183 [tests/gmagick-127_contrastImage_basic.phpt]
PASS Test Gmagick, contrastImage [tests/gmagick-127_contrastImage_basic.phpt]
TEST 130/183 [tests/gmagick-128_staticMethods.phpt]
PASS Test static methods [tests/gmagick-128_staticMethods.phpt]
TEST 131/183 [tests/gmagick-129_gettersAndSetters.phpt]
PASS Test static methods [tests/gmagick-129_gettersAndSetters.phpt]
TEST 132/183 [tests/gmagickdraw-001-setstrokecolor_setstrokewidth.phpt]
PASS Test set stroke color, set stroke width [tests/gmagickdraw-001-setstrokecolor_setstrokewidth.phpt]
TEST 133/183 [tests/gmagickdraw-002-ellipse.phpt]
PASS Test ellipse [tests/gmagickdraw-002-ellipse.phpt]
TEST 134/183 [tests/gmagickdraw-003-annotate.phpt]
FAIL Test annotate [tests/gmagickdraw-003-annotate.phpt]
TEST 135/183 [tests/gmagickdraw-004-arc.phpt]
PASS Test arc [tests/gmagickdraw-004-arc.phpt]
TEST 136/183 [tests/gmagickdraw-005-bezier.phpt]
PASS Test bezier [tests/gmagickdraw-005-bezier.phpt]
TEST 137/183 [tests/gmagickdraw-006-setfillcolor_getfillcolor.phpt]
SKIP Test setfillcolor, getfillcolor [tests/gmagickdraw-006-setfillcolor_getfillcolor.phpt] reason: QUANTUM_DEPTH=16
TEST 138/183 [tests/gmagickdraw-006-setfillcolor_getfillcolor_q16.phpt]
PASS Test setfillcolor, getfillcolor [tests/gmagickdraw-006-setfillcolor_getfillcolor_q16.phpt]
TEST 139/183 [tests/gmagickdraw-007-setfillopacity_getfillopacity.phpt]
PASS Test setfillopacity, getfillopacity [tests/gmagickdraw-007-setfillopacity_getfillopacity.phpt]
TEST 140/183 [tests/gmagickdraw-008-setfont_getfont.phpt]
PASS Test setfont, getfont [tests/gmagickdraw-008-setfont_getfont.phpt]
TEST 141/183 [tests/gmagickdraw-009-setfontsize_getfontsize.phpt]
PASS Test setfontsize, getfontsize [tests/gmagickdraw-009-setfontsize_getfontsize.phpt]
TEST 142/183 [tests/gmagickdraw-010-setfontstyle_getfontstyle.phpt]
PASS Test setfontstyle, getfontstyle [tests/gmagickdraw-010-setfontstyle_getfontstyle.phpt]
TEST 143/183 [tests/gmagickdraw-011-setfontweight_getfontweight.phpt]
PASS Test setfontweight, getfontweight [tests/gmagickdraw-011-setfontweight_getfontweight.phpt]
TEST 144/183 [tests/gmagickdraw-012-setstrokeopacity_getstrokeopacity.phpt]
PASS Test setstrokeopacity, getstrokeopacity [tests/gmagickdraw-012-setstrokeopacity_getstrokeopacity.phpt]
TEST 145/183 [tests/gmagickdraw-013-setstrokecolor_getstrokecolor.phpt]
SKIP Test setstrokecolor, getstrokecolor [tests/gmagickdraw-013-setstrokecolor_getstrokecolor.phpt] reason: QUANTUM_DEPTH=16
TEST 146/183 [tests/gmagickdraw-013-setstrokecolor_getstrokecolor_q16.phpt]
PASS Test setstrokecolor, getstrokecolor [tests/gmagickdraw-013-setstrokecolor_getstrokecolor_q16.phpt]
TEST 147/183 [tests/gmagickdraw-014-setstrokewidth_getstrokewidth.phpt]
PASS Test setstrokewidth, getstrokewidth [tests/gmagickdraw-014-setstrokewidth_getstrokewidth.phpt]
TEST 148/183 [tests/gmagickdraw-015-settextdecoration_gettextdecoration.phpt]
PASS Test settextdecoration, gettextdecoration [tests/gmagickdraw-015-settextdecoration_gettextdecoration.phpt]
TEST 149/183 [tests/gmagickdraw-016-settextencoding_gettextencoding.phpt]
PASS Test settextencoding, gettextencoding [tests/gmagickdraw-016-settextencoding_gettextencoding.phpt]
TEST 150/183 [tests/gmagickdraw-017-line.phpt]
PASS Test line [tests/gmagickdraw-017-line.phpt]
TEST 151/183 [tests/gmagickdraw-018-point.phpt]
PASS Test point [tests/gmagickdraw-018-point.phpt]
TEST 152/183 [tests/gmagickdraw-019-polygon.phpt]
PASS Test polygon [tests/gmagickdraw-019-polygon.phpt]
TEST 153/183 [tests/gmagickdraw-020-polyline.phpt]
PASS Test polyline [tests/gmagickdraw-020-polyline.phpt]
TEST 154/183 [tests/gmagickdraw-021-rectangle.phpt]
PASS Test rectangle [tests/gmagickdraw-021-rectangle.phpt]
TEST 155/183 [tests/gmagickdraw-022-rotate.phpt]
PASS Test rotate [tests/gmagickdraw-022-rotate.phpt]
TEST 156/183 [tests/gmagickdraw-023-roundrectangle.phpt]
PASS Test round rectangle [tests/gmagickdraw-023-roundrectangle.phpt]
TEST 157/183 [tests/gmagickdraw-024-scale.phpt]
PASS Test scale [tests/gmagickdraw-024-scale.phpt]
TEST 158/183 [tests/gmagickdraw-025-affine.phpt]
PASS Test affine [tests/gmagickdraw-025-affine.phpt]
TEST 159/183 [tests/gmagickdraw-026-setgravity_getgravity.phpt]
PASS Test affine [tests/gmagickdraw-026-setgravity_getgravity.phpt]
TEST 160/183 [tests/gmagickdraw-027-setantialias_getantialias.phpt]
PASS Test and get anti-alias [tests/gmagickdraw-027-setantialias_getantialias.phpt]
TEST 161/183 [tests/gmagickdraw-028-setlinecap_getlinecap.phpt]
PASS Test set and get line cap [tests/gmagickdraw-028-setlinecap_getlinecap.phpt]
TEST 162/183 [tests/gmagickdraw-029-setlinejoin_getlinejoin.phpt]
PASS Test stroke line join [tests/gmagickdraw-029-setlinejoin_getlinejoin.phpt]
TEST 163/183 [tests/gmagickdraw-030-setmiterlimit_getmiterlimit.phpt]
PASS Test get and set strokeMiterLimit [tests/gmagickdraw-030-setmiterlimit_getmiterlimit.phpt]
TEST 164/183 [tests/gmagickdraw-031-setdashstrokearray_getdashstrokearray.phpt]
PASS Test set and get stroke dash array [tests/gmagickdraw-031-setdashstrokearray_getdashstrokearray.phpt]
TEST 165/183 [tests/gmagickdraw-032_circle_basic.phpt]
PASS Test GmagickDraw, circle [tests/gmagickdraw-032_circle_basic.phpt]
TEST 166/183 [tests/gmagickdraw-033_setClipPath_basic.phpt]
PASS Test GmagickDraw, setClipPath [tests/gmagickdraw-033_setClipPath_basic.phpt]
TEST 167/183 [tests/gmagickdraw_034_setClipRule_basic.phpt]
PASS Test GmagickDraw, setClipRule [tests/gmagickdraw_034_setClipRule_basic.phpt]
TEST 168/183 [tests/gmagickdraw_035_setClipUnits_basic.phpt]
PASS Test GmagickDraw, setClipUnits [tests/gmagickdraw_035_setClipUnits_basic.phpt]
TEST 169/183 [tests/gmagickdraw_036_pushPattern_basic.phpt]
PASS Test GmagickDraw, pushPattern [tests/gmagickdraw_036_pushPattern_basic.phpt]
TEST 170/183 [tests/gmagickdraw_037_setFillRule_basic.phpt]
PASS Test GmagickDraw, setFillRule [tests/gmagickdraw_037_setFillRule_basic.phpt]
TEST 171/183 [tests/gmagickdraw_038_setFontStretch_basic.phpt]
FAIL Test GmagickDraw, setFontStretch [tests/gmagickdraw_038_setFontStretch_basic.phpt]
TEST 172/183 [tests/gmagickdraw_039_pathStart_basic.phpt]
PASS Test GmagickDraw, pathStart [tests/gmagickdraw_039_pathStart_basic.phpt]
TEST 173/183 [tests/gmagickdraw_040_pathCurveToQuadraticBezierAbsolute_basic.phpt]
PASS Test GmagickDraw, pathCurveToQuadraticBezierAbsolute [tests/gmagickdraw_040_pathCurveToQuadraticBezierAbsolute_basic.phpt]
TEST 174/183 [tests/gmagickdraw_041_popDefs_basic.phpt]
PASS Test GmagickDraw, popDefs [tests/gmagickdraw_041_popDefs_basic.phpt]
TEST 175/183 [tests/gmagickdraw_042_setTextAntialias_basic.phpt]
FAIL Test GmagickDraw, setTextAntialias [tests/gmagickdraw_042_setTextAntialias_basic.phpt]
TEST 176/183 [tests/gmagickdraw_043_setViewBox_basic.phpt]
PASS Test GmagickDraw, setViewBox [tests/gmagickdraw_043_setViewBox_basic.phpt]
TEST 177/183 [tests/gmagickdraw_044_setTextUnderColor_basic.phpt]
FAIL Test GmagickDraw, setTextUnderColor [tests/gmagickdraw_044_setTextUnderColor_basic.phpt]
TEST 178/183 [tests/gmagickdraw_045_setFontFamily_basic.phpt]
FAIL Test GmagickDraw, setFontFamily [tests/gmagickdraw_045_setFontFamily_basic.phpt]
TEST 179/183 [tests/gmagickpixel-001-setcolor_getcolor.phpt]
SKIP Test setColor and getColor methods [tests/gmagickpixel-001-setcolor_getcolor.phpt] reason: QUANTUM_DEPTH=16
TEST 180/183 [tests/gmagickpixel-002-setcolorvalue_getcolorvalue.phpt]
PASS Test setColorValue and getColorValue methods [tests/gmagickpixel-002-setcolorvalue_getcolorvalue.phpt]
TEST 181/183 [tests/gmagickpixel-003-getcolorcount.phpt]
PASS Test getColorcount method [tests/gmagickpixel-003-getcolorcount.phpt]
TEST 182/183 [tests/gmagickpixel-004-clone.phpt]
PASS Test object cloning and get [tests/gmagickpixel-004-clone.phpt]
TEST 183/183 [tests/gmagickpixel-005-setcolorvaluequantum_getcolorvaluequantum.phpt]
PASS Test setColorValueQuantum and getColorValueQuantum methods [tests/gmagickpixel-005-setcolorvaluequantum_getcolorvaluequantum.phpt]
=====================================================================
TIME END 2021-03-08 19:32:27
=====================================================================
TEST RESULT SUMMARY
---------------------------------------------------------------------
Exts skipped    :    0
Exts tested     :   33
---------------------------------------------------------------------

Number of tests :  183               177
Tests skipped   :    6 (  3.3%) --------
Tests warned    :    0 (  0.0%) (  0.0%)
Tests failed    :    6 (  3.3%) (  3.4%)
Expected fail   :    1 (  0.5%) (  0.6%)
Tests passed    :  170 ( 92.9%) ( 96.0%)
---------------------------------------------------------------------
Time taken      :    9 seconds
=====================================================================

=====================================================================
EXPECTED FAILED TEST SUMMARY
---------------------------------------------------------------------
Test Tutorial, deconstructGif [tests/gmagick-121_deconstructGif_basic.phpt]  XFAIL REASON: GraphicMagick has multiple issues with 'image counts'. It appears to be confused how many images are in the list.
=====================================================================

=====================================================================
FAILED TEST SUMMARY
---------------------------------------------------------------------
Test annotate image [tests/gmagick-006-annotateimage.phpt]
Test annotate [tests/gmagickdraw-003-annotate.phpt]
Test GmagickDraw, setFontStretch [tests/gmagickdraw_038_setFontStretch_basic.phpt]
Test GmagickDraw, setTextAntialias [tests/gmagickdraw_042_setTextAntialias_basic.phpt]
Test GmagickDraw, setTextUnderColor [tests/gmagickdraw_044_setTextUnderColor_basic.phpt]
Test GmagickDraw, setFontFamily [tests/gmagickdraw_045_setFontFamily_basic.phpt]
=====================================================================
You may have found a problem in PHP.
This report can be automatically sent to the PHP QA team at
http://qa.php.net/reports and http://news.php.net/php.qa.reports
This gives us a better understanding of PHP's behavior.
If you don't want to send the report immediately you can choose
option "s" to save it.	You can then email it to [email protected]et later.
Do you want to send this report now? [Yns]:
Notice: Trying to access array offset on value of type bool in /tmp/ext-src/trunk/run-tests.php on line 934
Please enter your email address.
(Your address will be mangled so that it will not go out on any
mailinglist in plain text):
Posting to http://qa.php.net/buildtest-process.php
make: *** [Makefile:132: test] Error 1