php-ext.com / php-signal-handler (from dev using PHP 8.0.5-buster)

Dockerfile
FROM php:8.0.5-buster
WORKDIR /tmp
RUN apt update && \
    apt install -y --no-install-recommends git subversion autoconf build-essential && \
    rm -rf /var/lib/apt/lists/*
RUN git clone --recursive --depth=1 https://github.com/rstgroup/php-signal-handler /tmp/ext-src && \
    cd /tmp/ext-src && \
    phpize && \
    ./configure --with-signal-handler && \
    make && \
    make test
Build output FAIL 9ss
Step 1/4 : FROM php:8.0.5-buster
---> 9d3d64fb1730
Step 2/4 : WORKDIR /tmp
---> Running in 1eeff1f84b12
Removing intermediate container 1eeff1f84b12
---> f15230478852
Step 3/4 : RUN apt update && apt install -y --no-install-recommends git subversion autoconf build-essential && rm -rf /var/lib/apt/lists/*
---> Running in 531776a6cbbc


WARNING: apt does not have a stable CLI interface. Use with caution in scripts.


Get:1 http://security.debian.org/debian-security buster/updates InRelease [65.4 kB]
Get:2 http://deb.debian.org/debian buster InRelease [121 kB]
Get:3 http://deb.debian.org/debian buster-updates InRelease [51.9 kB]
Get:4 http://security.debian.org/debian-security buster/updates/main amd64 Packages [285 kB]
Get:5 http://deb.debian.org/debian buster/main amd64 Packages [7907 kB]
Get:6 http://deb.debian.org/debian buster-updates/main amd64 Packages [10.9 kB]
Fetched 8441 kB in 1s (5822 kB/s)
Reading package lists...
Building dependency tree...
Reading state information...
2 packages can be upgraded. Run 'apt list --upgradable' to see them.


WARNING: 
apt
 
does not have a stable CLI interface. 
Use with caution in scripts.




Reading package lists...
Building dependency tree...
Reading state information...
autoconf is already the newest version (2.69-11).
The following package was automatically installed and is no longer required:
lsb-base
Use 'apt autoremove' to remove it.
The following additional packages will be installed:
git-man libapr1 libaprutil1 libcurl3-gnutls liberror-perl libexpat1
libpcre2-8-0 libserf-1-1 libsvn1 libutf8proc2
Suggested packages:
gettext-base git-daemon-run | git-daemon-sysvinit git-doc git-el git-email
git-gui gitk gitweb git-cvs git-mediawiki git-svn db5.3-util
libapache2-mod-svn subversion-tools
Recommended packages:
less ssh-client
The following NEW packages will be installed:
build-essential git git-man libapr1 libaprutil1 libcurl3-gnutls
liberror-perl libexpat1 libpcre2-8-0 libserf-1-1 libsvn1 libutf8proc2
subversion
0 upgraded, 13 newly installed, 0 to remove and 2 not upgraded.
Need to get 10.7 MB of archives.
After this operation, 50.2 MB of additional disk space will be used.
Get:1 http://security.debian.org/debian-security buster/updates/main amd64 libcurl3-gnutls amd64 7.64.0-4+deb10u2 [330 kB]
Get:2 http://deb.debian.org/debian buster/main amd64 build-essential amd64 12.6 [7576 B]
Get:3 http://deb.debian.org/debian buster/main amd64 libexpat1 amd64 2.2.6-2+deb10u1 [106 kB]
Get:4 http://deb.debian.org/debian buster/main amd64 libpcre2-8-0 amd64 10.32-5 [213 kB]
Get:5 http://deb.debian.org/debian buster/main amd64 liberror-perl all 0.17027-2 [30.9 kB]
Get:6 http://deb.debian.org/debian buster/main amd64 git-man all 1:2.20.1-2+deb10u3 [1620 kB]
Get:7 http://deb.debian.org/debian buster/main amd64 git amd64 1:2.20.1-2+deb10u3 [5633 kB]
Get:8 http://deb.debian.org/debian buster/main amd64 libapr1 amd64 1.6.5-1+b1 [102 kB]
Get:9 http://deb.debian.org/debian buster/main amd64 libaprutil1 amd64 1.6.1-4 [91.8 kB]
Get:10 http://deb.debian.org/debian buster/main amd64 libserf-1-1 amd64 1.3.9-7+b10 [53.6 kB]
Get:11 http://deb.debian.org/debian buster/main amd64 libutf8proc2 amd64 2.3.0-1 [53.0 kB]
Get:12 http://deb.debian.org/debian buster/main amd64 libsvn1 amd64 1.10.4-1+deb10u2 [1403 kB]
Get:13 http://deb.debian.org/debian buster/main amd64 subversion amd64 1.10.4-1+deb10u2 [1008 kB]
debconf: delaying package configuration, since apt-utils is not installed

Fetched 10.7 MB in 0s (75.5 MB/s)
Selecting previously unselected package build-essential.
(Reading database ...
(Reading database ... 5%
(Reading database ... 10%
(Reading database ... 15%
(Reading database ... 20%
(Reading database ... 25%
(Reading database ... 30%
(Reading database ... 35%
(Reading database ... 40%
(Reading database ... 45%
(Reading database ... 50%
(Reading database ... 55%
(Reading database ... 60%
(Reading database ... 65%
(Reading database ... 70%
(Reading database ... 75%
(Reading database ... 80%
(Reading database ... 85%
(Reading database ... 90%
(Reading database ... 95%
(Reading database ... 100%
(Reading database ...
12690 files and directories currently installed.)
Preparing to unpack .../00-build-essential_12.6_amd64.deb ...
Unpacking build-essential (12.6) ...
Selecting previously unselected package libcurl3-gnutls:amd64.
Preparing to unpack .../01-libcurl3-gnutls_7.64.0-4+deb10u2_amd64.deb ...
Unpacking libcurl3-gnutls:amd64 (7.64.0-4+deb10u2) ...
Selecting previously unselected package libexpat1:amd64.
Preparing to unpack .../02-libexpat1_2.2.6-2+deb10u1_amd64.deb ...
Unpacking libexpat1:amd64 (2.2.6-2+deb10u1) ...
Selecting previously unselected package libpcre2-8-0:amd64.
Preparing to unpack .../03-libpcre2-8-0_10.32-5_amd64.deb ...
Unpacking libpcre2-8-0:amd64 (10.32-5) ...
Selecting previously unselected package liberror-perl.
Preparing to unpack .../04-liberror-perl_0.17027-2_all.deb ...
Unpacking liberror-perl (0.17027-2) ...
Selecting previously unselected package git-man.
Preparing to unpack .../05-git-man_1%3a2.20.1-2+deb10u3_all.deb ...
Unpacking git-man (1:2.20.1-2+deb10u3) ...
Selecting previously unselected package git.
Preparing to unpack .../06-git_1%3a2.20.1-2+deb10u3_amd64.deb ...
Unpacking git (1:2.20.1-2+deb10u3) ...
Selecting previously unselected package libapr1:amd64.
Preparing to unpack .../07-libapr1_1.6.5-1+b1_amd64.deb ...
Unpacking libapr1:amd64 (1.6.5-1+b1) ...
Selecting previously unselected package libaprutil1:amd64.
Preparing to unpack .../08-libaprutil1_1.6.1-4_amd64.deb ...
Unpacking libaprutil1:amd64 (1.6.1-4) ...
Selecting previously unselected package libserf-1-1:amd64.
Preparing to unpack .../09-libserf-1-1_1.3.9-7+b10_amd64.deb ...
Unpacking libserf-1-1:amd64 (1.3.9-7+b10) ...
Selecting previously unselected package libutf8proc2:amd64.
Preparing to unpack .../10-libutf8proc2_2.3.0-1_amd64.deb ...
Unpacking libutf8proc2:amd64 (2.3.0-1) ...
Selecting previously unselected package libsvn1:amd64.
Preparing to unpack .../11-libsvn1_1.10.4-1+deb10u2_amd64.deb ...
Unpacking libsvn1:amd64 (1.10.4-1+deb10u2) ...
Selecting previously unselected package subversion.
Preparing to unpack .../12-subversion_1.10.4-1+deb10u2_amd64.deb ...
Unpacking subversion (1.10.4-1+deb10u2) ...
Setting up libexpat1:amd64 (2.2.6-2+deb10u1) ...
Setting up libutf8proc2:amd64 (2.3.0-1) ...
Setting up libapr1:amd64 (1.6.5-1+b1) ...
Setting up libcurl3-gnutls:amd64 (7.64.0-4+deb10u2) ...
Setting up liberror-perl (0.17027-2) ...
Setting up libpcre2-8-0:amd64 (10.32-5) ...
Setting up build-essential (12.6) ...
Setting up git-man (1:2.20.1-2+deb10u3) ...
Setting up libaprutil1:amd64 (1.6.1-4) ...
Setting up libserf-1-1:amd64 (1.3.9-7+b10) ...
Setting up git (1:2.20.1-2+deb10u3) ...
Setting up libsvn1:amd64 (1.10.4-1+deb10u2) ...
Setting up subversion (1.10.4-1+deb10u2) ...
Processing triggers for libc-bin (2.28-10) ...
Removing intermediate container 531776a6cbbc
---> 17b83c083f68
Step 4/4 : RUN git clone --recursive --depth=1 https://github.com/rstgroup/php-signal-handler /tmp/ext-src && cd /tmp/ext-src && phpize && ./configure --with-signal-handler && make && make test
---> Running in 86c67f42a075
Cloning into '/tmp/ext-src'...

Configuring for:
PHP Api Version:         20200930
Zend Module Api No:      20200930
Zend Extension Api No:   420200930
checking for grep that handles long lines and -e...
/bin/grep
checking for egrep...
/bin/grep -E
checking for a sed that does not truncate output...
/bin/sed
checking for pkg-config...
/usr/bin/pkg-config
checking pkg-config is at least version 0.9.0...
yes
checking for cc...
cc
checking whether the C compiler works...
yes
checking for C compiler default output file name...
a.out
checking for suffix of executables...
checking whether we are cross compiling...
no
checking for suffix of object files...
o
checking whether we are using the GNU C compiler...
yes
checking whether cc accepts -g...
yes
checking for cc option to accept ISO C89...
none needed
checking how to run the C preprocessor...
cc -E
checking for icc...
no
checking for suncc...
no
checking for system library directory...
lib
checking if compiler supports -R...
no
checking if compiler supports -Wl,-rpath,...
yes
checking build system type...
x86_64-pc-linux-gnu
checking host system type...
x86_64-pc-linux-gnu
checking target system type...
x86_64-pc-linux-gnu
checking for PHP prefix...
/usr/local
checking for PHP includes...
-I/usr/local/include/php -I/usr/local/include/php/main -I/usr/local/include/php/TSRM -I/usr/local/include/php/Zend -I/usr/local/include/php/ext -I/usr/local/include/php/ext/date/lib
checking for PHP extension directory...
/usr/local/lib/php/extensions/no-debug-non-zts-20200930
checking for PHP installed headers prefix...
/usr/local/include/php
checking if debug is enabled...
no
checking if zts is enabled...
no
checking for gawk...
no
checking for nawk...
nawk
checking if nawk is broken...
no
checking for signal_handler support...
yes, shared
checking for signal_handler files in default path...
checking for a sed that does not truncate output...
/bin/sed
checking for ld used by cc...
/usr/bin/ld
checking if the linker (/usr/bin/ld) is GNU ld...
yes
checking for /usr/bin/ld option to reload object files...
-r
checking for BSD-compatible nm...
/usr/bin/nm -B
checking whether ln -s works...
yes
checking how to recognize dependent libraries...
pass_all
checking for ANSI C header files...
yes
checking for sys/types.h...
yes
checking for sys/stat.h...
yes
checking for stdlib.h...
yes
checking for string.h...
yes
checking for memory.h...
yes
checking for strings.h...
yes
checking for inttypes.h...
yes
checking for stdint.h...
yes
checking for unistd.h...
yes
checking dlfcn.h usability...
yes
checking dlfcn.h presence...
yes
checking for dlfcn.h...
yes
checking the maximum length of command line arguments...
1572864
checking command to parse /usr/bin/nm -B output from cc object...
ok
checking for objdir...
.libs
checking for ar...
ar
checking for ranlib...
ranlib
checking for strip...
strip
checking if cc supports -fno-rtti -fno-exceptions...
no
checking for cc option to produce PIC...
-fPIC
checking if cc PIC flag -fPIC works...
yes
checking if cc static flag -static works...
yes
checking if cc supports -c -o file.o...
yes
checking whether the cc linker (/usr/bin/ld -m elf_x86_64) supports shared libraries...
yes
checking whether -lc should be explicitly linked in...
no
checking dynamic linker characteristics...
GNU/Linux ld.so
checking how to hardcode library paths into programs...
immediate
checking whether stripping libraries is possible...
yes
checking if libtool supports shared libraries...
yes
checking whether to build shared libraries...
yes
checking whether to build static libraries...
no
creating libtool
appending configuration tag "CXX" to libtool
configure: patching config.h.in
configure: creating ./config.status
config.status: creating config.h
/bin/bash /tmp/ext-src/libtool --mode=compile cc -I. -I/tmp/ext-src -I/tmp/ext-src/include -I/tmp/ext-src/main -I/tmp/ext-src -I/usr/local/include/php -I/usr/local/include/php/main -I/usr/local/include/php/TSRM -I/usr/local/include/php/Zend -I/usr/local/include/php/ext -I/usr/local/include/php/ext/date/lib  -DHAVE_CONFIG_H  -g -O2    -c /tmp/ext-src/signal_handler.c -o signal_handler.lo
mkdir .libs
cc -I. -I/tmp/ext-src -I/tmp/ext-src/include -I/tmp/ext-src/main -I/tmp/ext-src -I/usr/local/include/php -I/usr/local/include/php/main -I/usr/local/include/php/TSRM -I/usr/local/include/php/Zend -I/usr/local/include/php/ext -I/usr/local/include/php/ext/date/lib -DHAVE_CONFIG_H -g -O2 -c /tmp/ext-src/signal_handler.c  -fPIC -DPIC -o .libs/signal_handler.o
/tmp/ext-src/signal_handler.c: In function 'php_signal_callback_handler':

/tmp/ext-src/signal_handler.c:148:2: warning: implicit declaration of function 'TSRMLS_FETCH'; did you mean 'TSRMLS_CACHE'? [-Wimplicit-function-declaration]
  TSRMLS_FETCH();
  ^~~~~~~~~~~~
  TSRMLS_CACHE

/tmp/ext-src/signal_handler.c:162:25: error: expected ')' before 'TSRMLS_CC'
   php_error_docref(NULL TSRMLS_CC, E_ERROR, "Callback function not found for signo: %d", signo);
                         ^~~~~~~~~

/tmp/ext-src/signal_handler.c:162:3: error: too few arguments to function 'php_error_docref'
   php_error_docref(NULL TSRMLS_CC, E_ERROR, "Callback function not found for signo: %d", signo);
   ^~~~~~~~~~~~~~~~

In file included from /tmp/ext-src/signal_handler.c:25:
/usr/local/include/php/main/php.h:341:23: note: declared here
 PHPAPI ZEND_COLD void php_error_docref(const char *docref, int type, const char *format, ...)
                       ^~~~~~~~~~~~~~~~

In file included from /usr/local/include/php/main/php.h:35,
                 from /tmp/ext-src/signal_handler.c:25:
/tmp/ext-src/signal_handler.c:171:72: error: expected ')' before 'TSRMLS_CC'
  call_user_function(EG(function_table), NULL, handle, retval, 1, param TSRMLS_CC);
                                                                        ^~~~~~~~~
/usr/local/include/php/Zend/zend_API.h:514:75: note: in definition of macro 'call_user_function'
  _call_user_function_impl(object, function_name, retval_ptr, param_count, params, NULL)
                                                                           ^~~~~~

/usr/local/include/php/Zend/zend_API.h:514:2: error: too few arguments to function '_call_user_function_impl'
  _call_user_function_impl(object, function_name, retval_ptr, param_count, params, NULL)
  ^~~~~~~~~~~~~~~~~~~~~~~~
/tmp/ext-src/signal_handler.c:171:2: note: in expansion of macro 'call_user_function'
  call_user_function(EG(function_table), NULL, handle, retval, 1, param TSRMLS_CC);
  ^~~~~~~~~~~~~~~~~~

/usr/local/include/php/Zend/zend_API.h:511:22: note: declared here
 ZEND_API zend_result _call_user_function_impl(zval *object, zval *function_name, zval *retval_ptr, uint32_t param_count, zval params[], HashTable *named_params);
                      ^~~~~~~~~~~~~~~~~~~~~~~~

/tmp/ext-src/signal_handler.c: In function 'zif_attach_signal':

/tmp/ext-src/signal_handler.c:193:44: error: expected ')' before 'TSRMLS_CC'
  if (zend_parse_parameters(ZEND_NUM_ARGS() TSRMLS_CC, "lz", &signo, &handle) == FAILURE) {
                                            ^~~~~~~~~

/tmp/ext-src/signal_handler.c:193:6: error: too few arguments to function 'zend_parse_parameters'
  if (zend_parse_parameters(ZEND_NUM_ARGS() TSRMLS_CC, "lz", &signo, &handle) == FAILURE) {
      ^~~~~~~~~~~~~~~~~~~~~

In file included from /usr/local/include/php/main/php.h:35,
                 from /tmp/ext-src/signal_handler.c:25:
/usr/local/include/php/Zend/zend_API.h:304:22: note: declared here
 ZEND_API zend_result zend_parse_parameters(uint32_t num_args, const char *type_spec, ...);
                      ^~~~~~~~~~~~~~~~~~~~~

/tmp/ext-src/signal_handler.c:199:25: error: expected ')' before 'TSRMLS_CC'
   php_error_docref(NULL TSRMLS_CC, E_WARNING, "Invalid signal");
                         ^~~~~~~~~

/tmp/ext-src/signal_handler.c:199:3: error: too few arguments to function 'php_error_docref'
   php_error_docref(NULL TSRMLS_CC, E_WARNING, "Invalid signal");
   ^~~~~~~~~~~~~~~~

In file included from /tmp/ext-src/signal_handler.c:25:
/usr/local/include/php/main/php.h:341:23: note: declared here
 PHPAPI ZEND_COLD void php_error_docref(const char *docref, int type, const char *format, ...)
                       ^~~~~~~~~~~~~~~~

/tmp/ext-src/signal_handler.c:207:45: error: expected ')' before 'TSRMLS_CC'
  if (!zend_is_callable(handle, 0, &func_name TSRMLS_CC)) {
                                             ^~~~~~~~~~
                                             )

/tmp/ext-src/signal_handler.c:210:25: error: expected ')' before 'TSRMLS_CC'
   php_error_docref(NULL TSRMLS_CC, E_WARNING, "%s is not a callable function name error", ZSTR_VAL(func_name));
                         ^~~~~~~~~

/tmp/ext-src/signal_handler.c:210:3: error: too few arguments to function 'php_error_docref'
   php_error_docref(NULL TSRMLS_CC, E_WARNING, "%s is not a callable function name error", ZSTR_VAL(func_name));
   ^~~~~~~~~~~~~~~~

In file included from /tmp/ext-src/signal_handler.c:25:
/usr/local/include/php/main/php.h:341:23: note: declared here
 PHPAPI ZEND_COLD void php_error_docref(const char *docref, int type, const char *format, ...)
                       ^~~~~~~~~~~~~~~~

/tmp/ext-src/signal_handler.c:219:25: error: expected ')' before 'TSRMLS_CC'
   php_error_docref(NULL TSRMLS_CC, E_WARNING, "An error occurred while setting a signal handler for signo: %lu", signo);
                         ^~~~~~~~~

/tmp/ext-src/signal_handler.c:219:3: error: too few arguments to function 'php_error_docref'
   php_error_docref(NULL TSRMLS_CC, E_WARNING, "An error occurred while setting a signal handler for signo: %lu", signo);
   ^~~~~~~~~~~~~~~~

In file included from /tmp/ext-src/signal_handler.c:25:
/usr/local/include/php/main/php.h:341:23: note: declared here
 PHPAPI ZEND_COLD void php_error_docref(const char *docref, int type, const char *format, ...)
                       ^~~~~~~~~~~~~~~~

/tmp/ext-src/signal_handler.c: In function 'zif_detach_signal':

/tmp/ext-src/signal_handler.c:242:44: error: expected ')' before 'TSRMLS_CC'
  if (zend_parse_parameters(ZEND_NUM_ARGS() TSRMLS_CC, "l", &signo) == FAILURE) {
                                            ^~~~~~~~~

/tmp/ext-src/signal_handler.c:242:6: error: too few arguments to function 'zend_parse_parameters'
  if (zend_parse_parameters(ZEND_NUM_ARGS() TSRMLS_CC, "l", &signo) == FAILURE) {
      ^~~~~~~~~~~~~~~~~~~~~

In file included from /usr/local/include/php/main/php.h:35,
                 from /tmp/ext-src/signal_handler.c:25:
/usr/local/include/php/Zend/zend_API.h:304:22: note: declared here
 ZEND_API zend_result zend_parse_parameters(uint32_t num_args, const char *type_spec, ...);
                      ^~~~~~~~~~~~~~~~~~~~~

/tmp/ext-src/signal_handler.c:248:25: error: expected ')' before 'TSRMLS_CC'
   php_error_docref(NULL TSRMLS_CC, E_WARNING, "Invalid signal");
                         ^~~~~~~~~

/tmp/ext-src/signal_handler.c:248:3: error: too few arguments to function 'php_error_docref'
   php_error_docref(NULL TSRMLS_CC, E_WARNING, "Invalid signal");
   ^~~~~~~~~~~~~~~~

In file included from /tmp/ext-src/signal_handler.c:25:
/usr/local/include/php/main/php.h:341:23: note: declared here
 PHPAPI ZEND_COLD void php_error_docref(const char *docref, int type, const char *format, ...)
                       ^~~~~~~~~~~~~~~~

/tmp/ext-src/signal_handler.c:257:25: error: expected ')' before 'TSRMLS_CC'
   php_error_docref(NULL TSRMLS_CC, E_WARNING, "Cannot detach signo: %lu", signo);
                         ^~~~~~~~~

/tmp/ext-src/signal_handler.c:257:3: error: too few arguments to function 'php_error_docref'
   php_error_docref(NULL TSRMLS_CC, E_WARNING, "Cannot detach signo: %lu", signo);
   ^~~~~~~~~~~~~~~~

In file included from /tmp/ext-src/signal_handler.c:25:
/usr/local/include/php/main/php.h:341:23: note: declared here
 PHPAPI ZEND_COLD void php_error_docref(const char *docref, int type, const char *format, ...)
                       ^~~~~~~~~~~~~~~~

make: *** [Makefile:208: signal_handler.lo] Error 1