php-ext.com / svn (from dev using PHP 8.0.5-zts-buster)

Dockerfile
FROM php:8.0.5-zts-buster
WORKDIR /tmp
RUN apt update && \
    apt install -y --no-install-recommends git subversion autoconf build-essential && \
    apt install -y --no-install-recommends libsvn-dev git-svn && \
    rm -rf /var/lib/apt/lists/*
RUN svn checkout --revision HEAD https://svn.php.net/repository/pecl/svn /tmp/ext-src && \
    cd /tmp/ext-src/trunk && \
    phpize && \
    ./configure --with-svn && \
    make && \
    make test
Build output FAIL 13ss
Step 1/4 : FROM php:8.0.5-zts-buster
---> e89b8bc8c67a
Step 2/4 : WORKDIR /tmp
---> Running in 1cd5c34f3f43
Removing intermediate container 1cd5c34f3f43
---> 91293bace3a2
Step 3/4 : RUN apt update && apt install -y --no-install-recommends git subversion autoconf build-essential && apt install -y --no-install-recommends libsvn-dev git-svn && rm -rf /var/lib/apt/lists/*
---> Running in 2759c946a177


WARNING: apt does not have a stable CLI interface. Use with caution in scripts.


Get:1 http://security.debian.org/debian-security buster/updates InRelease [65.4 kB]
Get:2 http://deb.debian.org/debian buster InRelease [121 kB]
Get:3 http://deb.debian.org/debian buster-updates InRelease [51.9 kB]
Get:4 http://security.debian.org/debian-security buster/updates/main amd64 Packages [285 kB]
Get:5 http://deb.debian.org/debian buster/main amd64 Packages [7907 kB]
Get:6 http://deb.debian.org/debian buster-updates/main amd64 Packages [10.9 kB]
Fetched 8441 kB in 1s (5905 kB/s)
Reading package lists...
Building dependency tree...
Reading state information...
2 packages can be upgraded. Run 'apt list --upgradable' to see them.


WARNING: 
apt
 
does not have a stable CLI interface. 
Use with caution in scripts.




Reading package lists...
Building dependency tree...
Reading state information...
autoconf is already the newest version (2.69-11).
The following package was automatically installed and is no longer required:
lsb-base
Use 'apt autoremove' to remove it.
The following additional packages will be installed:
git-man libapr1 libaprutil1 libcurl3-gnutls liberror-perl libexpat1
libpcre2-8-0 libserf-1-1 libsvn1 libutf8proc2
Suggested packages:
gettext-base git-daemon-run | git-daemon-sysvinit git-doc git-el git-email
git-gui gitk gitweb git-cvs git-mediawiki git-svn db5.3-util
libapache2-mod-svn subversion-tools
Recommended packages:
less ssh-client
The following NEW packages will be installed:
build-essential git git-man libapr1 libaprutil1 libcurl3-gnutls
liberror-perl libexpat1 libpcre2-8-0 libserf-1-1 libsvn1 libutf8proc2
subversion
0 upgraded, 13 newly installed, 0 to remove and 2 not upgraded.
Need to get 10.7 MB of archives.
After this operation, 50.2 MB of additional disk space will be used.
Get:1 http://security.debian.org/debian-security buster/updates/main amd64 libcurl3-gnutls amd64 7.64.0-4+deb10u2 [330 kB]
Get:2 http://deb.debian.org/debian buster/main amd64 build-essential amd64 12.6 [7576 B]
Get:3 http://deb.debian.org/debian buster/main amd64 libexpat1 amd64 2.2.6-2+deb10u1 [106 kB]
Get:4 http://deb.debian.org/debian buster/main amd64 libpcre2-8-0 amd64 10.32-5 [213 kB]
Get:5 http://deb.debian.org/debian buster/main amd64 liberror-perl all 0.17027-2 [30.9 kB]
Get:6 http://deb.debian.org/debian buster/main amd64 git-man all 1:2.20.1-2+deb10u3 [1620 kB]
Get:7 http://deb.debian.org/debian buster/main amd64 git amd64 1:2.20.1-2+deb10u3 [5633 kB]
Get:8 http://deb.debian.org/debian buster/main amd64 libapr1 amd64 1.6.5-1+b1 [102 kB]
Get:9 http://deb.debian.org/debian buster/main amd64 libaprutil1 amd64 1.6.1-4 [91.8 kB]
Get:10 http://deb.debian.org/debian buster/main amd64 libserf-1-1 amd64 1.3.9-7+b10 [53.6 kB]
Get:11 http://deb.debian.org/debian buster/main amd64 libutf8proc2 amd64 2.3.0-1 [53.0 kB]
Get:12 http://deb.debian.org/debian buster/main amd64 libsvn1 amd64 1.10.4-1+deb10u2 [1403 kB]
Get:13 http://deb.debian.org/debian buster/main amd64 subversion amd64 1.10.4-1+deb10u2 [1008 kB]
debconf: delaying package configuration, since apt-utils is not installed

Fetched 10.7 MB in 0s (83.8 MB/s)
Selecting previously unselected package build-essential.
(Reading database ...
(Reading database ... 5%
(Reading database ... 10%
(Reading database ... 15%
(Reading database ... 20%
(Reading database ... 25%
(Reading database ... 30%
(Reading database ... 35%
(Reading database ... 40%
(Reading database ... 45%
(Reading database ... 50%
(Reading database ... 55%
(Reading database ... 60%
(Reading database ... 65%
(Reading database ... 70%
(Reading database ... 75%
(Reading database ... 80%
(Reading database ... 85%
(Reading database ... 90%
(Reading database ... 95%
(Reading database ... 100%
(Reading database ...
12690 files and directories currently installed.)
Preparing to unpack .../00-build-essential_12.6_amd64.deb ...
Unpacking build-essential (12.6) ...
Selecting previously unselected package libcurl3-gnutls:amd64.
Preparing to unpack .../01-libcurl3-gnutls_7.64.0-4+deb10u2_amd64.deb ...
Unpacking libcurl3-gnutls:amd64 (7.64.0-4+deb10u2) ...
Selecting previously unselected package libexpat1:amd64.
Preparing to unpack .../02-libexpat1_2.2.6-2+deb10u1_amd64.deb ...
Unpacking libexpat1:amd64 (2.2.6-2+deb10u1) ...
Selecting previously unselected package libpcre2-8-0:amd64.
Preparing to unpack .../03-libpcre2-8-0_10.32-5_amd64.deb ...
Unpacking libpcre2-8-0:amd64 (10.32-5) ...
Selecting previously unselected package liberror-perl.
Preparing to unpack .../04-liberror-perl_0.17027-2_all.deb ...
Unpacking liberror-perl (0.17027-2) ...
Selecting previously unselected package git-man.
Preparing to unpack .../05-git-man_1%3a2.20.1-2+deb10u3_all.deb ...
Unpacking git-man (1:2.20.1-2+deb10u3) ...
Selecting previously unselected package git.
Preparing to unpack .../06-git_1%3a2.20.1-2+deb10u3_amd64.deb ...
Unpacking git (1:2.20.1-2+deb10u3) ...
Selecting previously unselected package libapr1:amd64.
Preparing to unpack .../07-libapr1_1.6.5-1+b1_amd64.deb ...
Unpacking libapr1:amd64 (1.6.5-1+b1) ...
Selecting previously unselected package libaprutil1:amd64.
Preparing to unpack .../08-libaprutil1_1.6.1-4_amd64.deb ...
Unpacking libaprutil1:amd64 (1.6.1-4) ...
Selecting previously unselected package libserf-1-1:amd64.
Preparing to unpack .../09-libserf-1-1_1.3.9-7+b10_amd64.deb ...
Unpacking libserf-1-1:amd64 (1.3.9-7+b10) ...
Selecting previously unselected package libutf8proc2:amd64.
Preparing to unpack .../10-libutf8proc2_2.3.0-1_amd64.deb ...
Unpacking libutf8proc2:amd64 (2.3.0-1) ...
Selecting previously unselected package libsvn1:amd64.
Preparing to unpack .../11-libsvn1_1.10.4-1+deb10u2_amd64.deb ...
Unpacking libsvn1:amd64 (1.10.4-1+deb10u2) ...
Selecting previously unselected package subversion.
Preparing to unpack .../12-subversion_1.10.4-1+deb10u2_amd64.deb ...
Unpacking subversion (1.10.4-1+deb10u2) ...
Setting up libexpat1:amd64 (2.2.6-2+deb10u1) ...
Setting up libutf8proc2:amd64 (2.3.0-1) ...
Setting up libapr1:amd64 (1.6.5-1+b1) ...
Setting up libcurl3-gnutls:amd64 (7.64.0-4+deb10u2) ...
Setting up liberror-perl (0.17027-2) ...
Setting up libpcre2-8-0:amd64 (10.32-5) ...
Setting up build-essential (12.6) ...
Setting up git-man (1:2.20.1-2+deb10u3) ...
Setting up libaprutil1:amd64 (1.6.1-4) ...
Setting up libserf-1-1:amd64 (1.3.9-7+b10) ...
Setting up git (1:2.20.1-2+deb10u3) ...
Setting up libsvn1:amd64 (1.10.4-1+deb10u2) ...
Setting up subversion (1.10.4-1+deb10u2) ...
Processing triggers for libc-bin (2.28-10) ...


WARNING: 
apt
 
does not have a stable CLI interface. 
Use with caution in scripts.




Reading package lists...
Building dependency tree...
Reading state information...
The following package was automatically installed and is no longer required:
lsb-base
Use 'apt autoremove' to remove it.
The following additional packages will be installed:
libapr1-dev libaprutil1-dev libexpat1-dev libldap2-dev libsctp-dev libsctp1
libsvn-perl libterm-readkey-perl libyaml-perl uuid-dev
Suggested packages:
git-doc python lksctp-tools libserf-dev libsvn-doc zlib1g-dev
libyaml-shell-perl
Recommended packages:
libyaml-libyaml-perl | libyaml-syck-perl
The following NEW packages will be installed:
git-svn libapr1-dev libaprutil1-dev libexpat1-dev libldap2-dev libsctp-dev
libsctp1 libsvn-dev libsvn-perl libterm-readkey-perl libyaml-perl uuid-dev
0 upgraded, 12 newly installed, 0 to remove and 2 not upgraded.
Need to get 5536 kB of archives.
After this operation, 32.1 MB of additional disk space will be used.
Get:1 http://deb.debian.org/debian buster/main amd64 libsvn-perl amd64 1.10.4-1+deb10u2 [1044 kB]
Get:2 http://deb.debian.org/debian buster/main amd64 libyaml-perl all 1.27-1 [66.8 kB]
Get:3 http://deb.debian.org/debian buster/main amd64 libterm-readkey-perl amd64 2.38-1 [27.4 kB]
Get:4 http://deb.debian.org/debian buster/main amd64 git-svn all 1:2.20.1-2+deb10u3 [867 kB]
Get:5 http://deb.debian.org/debian buster/main amd64 uuid-dev amd64 2.33.1-0.1 [93.6 kB]
Get:6 http://deb.debian.org/debian buster/main amd64 libsctp1 amd64 1.0.18+dfsg-1 [28.3 kB]
Get:7 http://deb.debian.org/debian buster/main amd64 libsctp-dev amd64 1.0.18+dfsg-1 [81.5 kB]
Get:8 http://deb.debian.org/debian buster/main amd64 libapr1-dev amd64 1.6.5-1+b1 [707 kB]
Get:9 http://deb.debian.org/debian buster/main amd64 libldap2-dev amd64 2.4.47+dfsg-3+deb10u6 [332 kB]
Get:10 http://deb.debian.org/debian buster/main amd64 libexpat1-dev amd64 2.2.6-2+deb10u1 [153 kB]
Get:11 http://deb.debian.org/debian buster/main amd64 libaprutil1-dev amd64 1.6.1-4 [404 kB]
Get:12 http://deb.debian.org/debian buster/main amd64 libsvn-dev amd64 1.10.4-1+deb10u2 [1731 kB]
debconf: delaying package configuration, since apt-utils is not installed

Fetched 5536 kB in 0s (67.8 MB/s)
Selecting previously unselected package libsvn-perl:amd64.
(Reading database ...
(Reading database ... 5%
(Reading database ... 10%
(Reading database ... 15%
(Reading database ... 20%
(Reading database ... 25%
(Reading database ... 30%
(Reading database ... 35%
(Reading database ... 40%
(Reading database ... 45%
(Reading database ... 50%
(Reading database ... 55%
(Reading database ... 60%
(Reading database ... 65%
(Reading database ... 70%
(Reading database ... 75%
(Reading database ... 80%
(Reading database ... 85%
(Reading database ... 90%
(Reading database ... 95%
(Reading database ... 100%
(Reading database ...
13812 files and directories currently installed.)
Preparing to unpack .../00-libsvn-perl_1.10.4-1+deb10u2_amd64.deb ...
Unpacking libsvn-perl:amd64 (1.10.4-1+deb10u2) ...
Selecting previously unselected package libyaml-perl.
Preparing to unpack .../01-libyaml-perl_1.27-1_all.deb ...
Unpacking libyaml-perl (1.27-1) ...
Selecting previously unselected package libterm-readkey-perl.
Preparing to unpack .../02-libterm-readkey-perl_2.38-1_amd64.deb ...
Unpacking libterm-readkey-perl (2.38-1) ...
Selecting previously unselected package git-svn.
Preparing to unpack .../03-git-svn_1%3a2.20.1-2+deb10u3_all.deb ...
Unpacking git-svn (1:2.20.1-2+deb10u3) ...
Selecting previously unselected package uuid-dev:amd64.
Preparing to unpack .../04-uuid-dev_2.33.1-0.1_amd64.deb ...
Unpacking uuid-dev:amd64 (2.33.1-0.1) ...
Selecting previously unselected package libsctp1:amd64.
Preparing to unpack .../05-libsctp1_1.0.18+dfsg-1_amd64.deb ...
Unpacking libsctp1:amd64 (1.0.18+dfsg-1) ...
Selecting previously unselected package libsctp-dev:amd64.
Preparing to unpack .../06-libsctp-dev_1.0.18+dfsg-1_amd64.deb ...
Unpacking libsctp-dev:amd64 (1.0.18+dfsg-1) ...
Selecting previously unselected package libapr1-dev.
Preparing to unpack .../07-libapr1-dev_1.6.5-1+b1_amd64.deb ...
Unpacking libapr1-dev (1.6.5-1+b1) ...
Selecting previously unselected package libldap2-dev:amd64.
Preparing to unpack .../08-libldap2-dev_2.4.47+dfsg-3+deb10u6_amd64.deb ...
Unpacking libldap2-dev:amd64 (2.4.47+dfsg-3+deb10u6) ...
Selecting previously unselected package libexpat1-dev:amd64.
Preparing to unpack .../09-libexpat1-dev_2.2.6-2+deb10u1_amd64.deb ...
Unpacking libexpat1-dev:amd64 (2.2.6-2+deb10u1) ...
Selecting previously unselected package libaprutil1-dev.
Preparing to unpack .../10-libaprutil1-dev_1.6.1-4_amd64.deb ...
Unpacking libaprutil1-dev (1.6.1-4) ...
Selecting previously unselected package libsvn-dev:amd64.
Preparing to unpack .../11-libsvn-dev_1.10.4-1+deb10u2_amd64.deb ...
Unpacking libsvn-dev:amd64 (1.10.4-1+deb10u2) ...
Setting up libsvn-perl:amd64 (1.10.4-1+deb10u2) ...
Setting up libyaml-perl (1.27-1) ...
Setting up libldap2-dev:amd64 (2.4.47+dfsg-3+deb10u6) ...
Setting up libexpat1-dev:amd64 (2.2.6-2+deb10u1) ...
Setting up uuid-dev:amd64 (2.33.1-0.1) ...
Setting up libsctp1:amd64 (1.0.18+dfsg-1) ...
Setting up libterm-readkey-perl (2.38-1) ...
Setting up git-svn (1:2.20.1-2+deb10u3) ...
Setting up libsctp-dev:amd64 (1.0.18+dfsg-1) ...
Setting up libapr1-dev (1.6.5-1+b1) ...
Setting up libaprutil1-dev (1.6.1-4) ...
Setting up libsvn-dev:amd64 (1.10.4-1+deb10u2) ...
Processing triggers for libc-bin (2.28-10) ...
Removing intermediate container 2759c946a177
---> 7ad73c09175e
Step 4/4 : RUN svn checkout --revision HEAD https://svn.php.net/repository/pecl/svn /tmp/ext-src && cd /tmp/ext-src/trunk && phpize && ./configure --with-svn && make && make test
---> Running in 8e7bbceefec0
A    ext-src/trunk
A    ext-src/trunk/tests
A    ext-src/trunk/tests/r
A    ext-src/trunk/tests/r/db
A    ext-src/trunk/tests/r/db/revs
A    ext-src/trunk/tests/r/db/revprops
A    ext-src/trunk/tests/r/conf
A    ext-src/trunk/tests/r/locks
A    ext-src/trunk/package.xml
A    ext-src/trunk/php_svn.h
A    ext-src/trunk/examples
A    ext-src/trunk/tests/r/locks/db.lock
A    ext-src/trunk/tests/r/db/revprops/5
A    ext-src/trunk/tests/checkout1.phpt
A    ext-src/trunk/tests/r/db/uuid
A    ext-src/trunk/svn.c
A    ext-src/tags
A    ext-src/tags/svn-2.0.3
A    ext-src/trunk/tests/log1.phpt
A    ext-src/trunk/tests/r/db/format
A    ext-src/trunk/tests/log3.phpt
A    ext-src/trunk/tests/r/conf/passwd
A    ext-src/tags/svn-2.0.3/examples
A    ext-src/trunk/tests/log4.phpt
A    ext-src/trunk/tests/r/format
A    ext-src/trunk/tests/log8.phpt
A    ext-src/trunk/tests/r/README.txt
A    ext-src/tags/svn-1.0.3
A    ext-src/trunk/tests/cat.phpt
A    ext-src/trunk/tests/log6.phpt
A    ext-src/trunk/tests/utils.inc
A    ext-src/trunk/tests/log9.phpt
A    ext-src/trunk/CREDITS
A    ext-src/tags/svn-1.0.3/examples
A    ext-src/trunk/examples/hook_emailcommit.php
A    ext-src/trunk/LICENSE
A    ext-src/trunk/tests/log10.phpt
A    ext-src/trunk/tests/log5.phpt
A    ext-src/tags/svn-1.0.2
A    ext-src/trunk/tests/log7.phpt
A    ext-src/trunk/config.m4
A    ext-src/trunk/TODO
A    ext-src/trunk/config.w32
A    ext-src/trunk/tests/log2.phpt
A    ext-src/trunk/tests/r/db/revs/0
A    ext-src/tags/svn-2.0.3/config.m4
A    ext-src/tags/svn-2.0.3/LICENSE
A    ext-src/tags/svn-2.0.3/config.w32
A    ext-src/tags/svn-1.0.2/examples
A    ext-src/tags/svn-1.0.1
A    ext-src/trunk/tests/r/db/revs/1
A    ext-src/trunk/tests/r/db/revs/2
A    ext-src/tags/svn-2.0.3/package.xml
A    ext-src/tags/svn-2.0.3/examples/hook_emailcommit.php
A    ext-src/tags/svn-2.0.3/php_svn.h
A    ext-src/trunk/tests/r/db/revs/3
A    ext-src/tags/svn-1.0.3/package.xml
A    ext-src/trunk/tests/r/db/revs/4
A    ext-src/tags/svn-1.0.1/examples
A    ext-src/tags/svn-1.0.0
A    ext-src/tags/svn-1.0.3/CREDITS
A    ext-src/trunk/tests/r/db/revs/5
A    ext-src/tags/svn-1.0.3/EXPERIMENTAL
A    ext-src/tags/svn-1.0.3/examples/hook_copycommit.php
A    ext-src/trunk/tests/r/db/write-lock
A    ext-src/tags/svn-1.0.3/php_svn.h
A    ext-src/tags/svn-1.0.3/svn.c
A    ext-src/trunk/tests/r/db/revprops/0
A    ext-src/tags/svn-1.0.0/examples
A    ext-src/tags/RELEASE_0_5_0
A    ext-src/trunk/tests/r/db/revprops/1
A    ext-src/tags/svn-1.0.2/php_svn.h
A    ext-src/tags/svn-1.0.2/svn.c
A    ext-src/tags/svn-1.0.3/config.w32
A    ext-src/trunk/tests/r/db/revprops/2
A    ext-src/tags/svn-1.0.2/config.w32
A    ext-src/tags/svn-1.0.2/CREDITS
A    ext-src/tags/svn-1.0.2/examples/hook_emailcommit.php
A    ext-src/tags/RELEASE_0_5_0/examples
A    ext-src/trunk/tests/r/db/revprops/3
A    ext-src/tags/svn-1.0.2/package.xml
A    ext-src/trunk/tests/r/db/revprops/4
A    ext-src/tags/svn-1.0.1/config.m4
A    ext-src/tags/RELEASE_0_5_0/tests
A    ext-src/tags/svn-1.0.1/config.w32
A    ext-src/trunk/tests/r/db/current
A    ext-src/tags/svn-1.0.2/examples/hook_copycommit.php
A    ext-src/trunk/tests/r/db/fs-type
A    ext-src/tags/svn-1.0.1/examples/hook_emailcommit.php
A    ext-src/trunk/tests/r/conf/svnserve.conf
A    ext-src/tags/svn-1.0.1/CREDITS
A    ext-src/tags/svn-1.0.0/config.m4
A    ext-src/tags/svn-1.0.1/svn.c
A    ext-src/tags/RELEASE_0_5_0/tests/r
A    ext-src/tags/RELEASE_0_5_0/tests/r/db
A    ext-src/tags/RELEASE_0_5_0/tests/r/db/revs
A    ext-src/trunk/tests/r/conf/authz
A    ext-src/tags/svn-1.0.0/config.w32
A    ext-src/tags/svn-1.0.1/examples/hook_copycommit.php
A    ext-src/tags/svn-1.0.0/examples/hook_emailcommit.php
A    ext-src/trunk/tests/r/locks/db-logs.lock
A    ext-src/tags/svn-1.0.0/CREDITS
A    ext-src/trunk/tests/checkout2.phpt
A    ext-src/tags/svn-1.0.0/svn.c
A    ext-src/tags/RELEASE_0_5_0/tests/r/db/revprops
A    ext-src/tags/RELEASE_0_5_0/php_svn.h
A    ext-src/tags/RELEASE_0_5_0/svn.c
A    ext-src/trunk/tests/status.phpt
A    ext-src/tags/svn-1.0.0/examples/hook_copycommit.php
A    ext-src/tags/RELEASE_0_5_0/config.m4
A    ext-src/tags/RELEASE_0_5_0/examples/hook_emailcommit.php
A    ext-src/trunk/examples/hook_copycommit.php
A    ext-src/tags/RELEASE_0_5_0/TODO
A    ext-src/tags/RELEASE_0_5_0/tests/r/conf
A    ext-src/tags/svn-2.0.3/CREDITS
A    ext-src/tags/RELEASE_0_5_0/tests/log6.phpt
A    ext-src/tags/RELEASE_0_5_0/config.w32
A    ext-src/tags/RELEASE_0_5_0/examples/hook_copycommit.php
A    ext-src/tags/RELEASE_0_5_0/tests/r/locks
A    ext-src/tags/svn-2.0.3/examples/hook_copycommit.php
A    ext-src/tags/RELEASE_0_5_0/tests/log9.phpt
A    ext-src/tags/RELEASE_0_5_0/tests/log5.phpt
A    ext-src/tags/RELEASE_0_5_0/tests/log10.phpt
A    ext-src/tags/RELEASE_0_5_0/tests/log7.phpt
A    ext-src/tags/RELEASE_0_5_0/tests/log8.phpt
A    ext-src/tags/RELEASE_0_5_0/tests/r/db/revs/0
A    ext-src/tags/RELEASE_0_5_0/tests/log3.phpt
A    ext-src/tags/svn-2.0.3/svn.c
A    ext-src/tags/RELEASE_0_4
A    ext-src/tags/RELEASE_0_5_0/tests/r/db/revs/1
A    ext-src/tags/RELEASE_0_5_0/tests/r/db/revs/3
A    ext-src/tags/RELEASE_0_5_0/tests/r/db/revs/4
A    ext-src/tags/svn-1.0.3/examples/hook_emailcommit.php
A    ext-src/tags/RELEASE_0_4/examples
A    ext-src/tags/RELEASE_0_5_0/tests/r/db/revs/5
A    ext-src/tags/svn-1.0.3/config.m4
A    ext-src/tags/RELEASE_0_5_0/tests/r/db/revprops/1
A    ext-src/tags/RELEASE_0_5_0/tests/r/db/revprops/0
A    ext-src/tags/RELEASE_0_2
A    ext-src/tags/RELEASE_0_5_0/tests/r/db/revprops/2
A    ext-src/tags/svn-1.0.2/config.m4
A    ext-src/tags/RELEASE_0_5_0/tests/r/db/revprops/4
A    ext-src/tags/RELEASE_0_5_0/tests/r/db/revprops/5
A    ext-src/tags/RELEASE_0_2/examples
A    ext-src/tags/RELEASE_0_5_0/tests/r/db/current
A    ext-src/tags/RELEASE_0_5_0/tests/r/db/fs-type
A    ext-src/tags/svn-1.0.2/EXPERIMENTAL
A    ext-src/tags/RELEASE_0_5_0/tests/r/db/format
A    ext-src/tags/RELEASE_0_5_0/tests/r/conf/svnserve.conf
A    ext-src/branches
A    ext-src/tags/svn-1.0.1/php_svn.h
A    ext-src/tags/RELEASE_0_5_0/tests/r/format
A    ext-src/tags/RELEASE_0_5_0/tests/r/conf/authz
A    ext-src/tags/RELEASE_0_5_0/tests/r/locks/db.lock
A    ext-src/tags/svn-1.0.1/EXPERIMENTAL
A    ext-src/tags/RELEASE_0_5_0/tests/checkout1.phpt
A    ext-src/tags/RELEASE_0_5_0/tests/checkout2.phpt
A    ext-src/tags/RELEASE_0_5_0/tests/r/README.txt
A    ext-src/tags/svn-1.0.0/php_svn.h
A    ext-src/tags/svn-1.0.0/EXPERIMENTAL
A    ext-src/tags/RELEASE_0_5_0/tests/status.phpt
A    ext-src/tags/RELEASE_0_5_0/package2.xml
A    ext-src/tags/RELEASE_0_5_0/EXPERIMENTAL
A    ext-src/tags/RELEASE_0_5_0/tests/log1.phpt
A    ext-src/tags/RELEASE_0_5_0/CREDITS
A    ext-src/tags/RELEASE_0_4/config.m4
A    ext-src/tags/RELEASE_0_4/examples/hook_emailcommit.php
A    ext-src/tags/RELEASE_0_5_0/tests/cat.phpt
A    ext-src/tags/RELEASE_0_4/svn.c
A    ext-src/tags/RELEASE_0_4/php_svn.h
A    ext-src/tags/RELEASE_0_4/CREDITS
A    ext-src/tags/RELEASE_0_5_0/tests/log4.phpt
A    ext-src/tags/RELEASE_0_4/config.w32
A    ext-src/tags/RELEASE_0_2/php_svn.h
A    ext-src/tags/RELEASE_0_5_0/tests/log2.phpt
A    ext-src/tags/RELEASE_0_2/svn.c
A    ext-src/tags/RELEASE_0_2/package2.xml
A    ext-src/tags/RELEASE_0_2/examples/hook_copycommit.php
A    ext-src/tags/RELEASE_0_5_0/tests/r/db/revs/2
A    ext-src/tags/RELEASE_0_2/examples/hook_emailcommit.php
A    ext-src/tags/RELEASE_0_2/config.w32
A    ext-src/tags/RELEASE_0_5_0/tests/r/db/write-lock
A    ext-src/tags/RELEASE_0_2/EXPERIMENTAL
A    ext-src/tags/RELEASE_0_5_0/tests/r/db/revprops/3
A    ext-src/tags/RELEASE_0_5_0/tests/r/db/uuid
A    ext-src/tags/RELEASE_0_5_0/tests/r/conf/passwd
A    ext-src/tags/RELEASE_0_5_0/tests/r/locks/db-logs.lock
A    ext-src/tags/RELEASE_0_5_0/tests/utils.inc
A    ext-src/tags/RELEASE_0_4/package2.xml
A    ext-src/tags/RELEASE_0_4/examples/hook_copycommit.php
A    ext-src/tags/RELEASE_0_4/EXPERIMENTAL
A    ext-src/tags/RELEASE_0_2/config.m4
A    ext-src/tags/RELEASE_0_2/CREDITS
Checked out revision 352318.
Configuring for:
PHP Api Version:         20200930
Zend Module Api No:      20200930
Zend Extension Api No:   420200930
checking for grep that handles long lines and -e...
/bin/grep
checking for egrep...
/bin/grep -E
checking for a sed that does not truncate output...
/bin/sed
checking for pkg-config...
/usr/bin/pkg-config
checking pkg-config is at least version 0.9.0...
yes
checking for cc...
cc
checking whether the C compiler works...
yes
checking for C compiler default output file name...
a.out
checking for suffix of executables...
checking whether we are cross compiling...
no
checking for suffix of object files...
o
checking whether we are using the GNU C compiler...
yes
checking whether cc accepts -g...
yes
checking for cc option to accept ISO C89...
none needed
checking how to run the C preprocessor...
cc -E
checking for icc...
no
checking for suncc...
no
checking for system library directory...
lib
checking if compiler supports -R...
no
checking if compiler supports -Wl,-rpath,...
yes
checking build system type...
x86_64-pc-linux-gnu
checking host system type...
x86_64-pc-linux-gnu
checking target system type...
x86_64-pc-linux-gnu
checking for PHP prefix...
/usr/local
checking for PHP includes...
-I/usr/local/include/php -I/usr/local/include/php/main -I/usr/local/include/php/TSRM -I/usr/local/include/php/Zend -I/usr/local/include/php/ext -I/usr/local/include/php/ext/date/lib
checking for PHP extension directory...
/usr/local/lib/php/extensions/no-debug-zts-20200930
checking for PHP installed headers prefix...
/usr/local/include/php
checking if debug is enabled...
no
checking if zts is enabled...
yes
checking for gawk...
no
checking for nawk...
nawk
checking if nawk is broken...
no
checking for svn support...
yes, shared
checking for specifying the location of apr for svn...
yes, shared
checking for svn includes...
Found libsvn 1.10.4
checking for apr and apr-util...
Found apr 1.6.5
libsvn includes: "-I/usr/include/subversion-1 -I/usr/include/apr-1.0 -DLINUX -D_REENTRANT -D_GNU_SOURCE"
libsvn ldflags: "-lsvn_client-1 -lsvn_fs-1 -lsvn_repos-1 -lsvn_subr-1 -L/usr/lib/x86_64-linux-gnu -lapr-1"
checking for a sed that does not truncate output...
/bin/sed
checking for ld used by cc...
/usr/bin/ld
checking if the linker (/usr/bin/ld) is GNU ld...
yes
checking for /usr/bin/ld option to reload object files...
-r
checking for BSD-compatible nm...
/usr/bin/nm -B
checking whether ln -s works...
yes
checking how to recognize dependent libraries...
pass_all
checking for ANSI C header files...
yes
checking for sys/types.h...
yes
checking for sys/stat.h...
yes
checking for stdlib.h...
yes
checking for string.h...
yes
checking for memory.h...
yes
checking for strings.h...
yes
checking for inttypes.h...
yes
checking for stdint.h...
yes
checking for unistd.h...
yes
checking dlfcn.h usability...
yes
checking dlfcn.h presence...
yes
checking for dlfcn.h...
yes
checking the maximum length of command line arguments...
1572864
checking command to parse /usr/bin/nm -B output from cc object...
ok
checking for objdir...
.libs
checking for ar...
ar
checking for ranlib...
ranlib
checking for strip...
strip
checking if cc supports -fno-rtti -fno-exceptions...
no
checking for cc option to produce PIC...
-fPIC
checking if cc PIC flag -fPIC works...
yes
checking if cc static flag -static works...
yes
checking if cc supports -c -o file.o...
yes
checking whether the cc linker (/usr/bin/ld -m elf_x86_64) supports shared libraries...
yes
checking whether -lc should be explicitly linked in...
no
checking dynamic linker characteristics...
GNU/Linux ld.so
checking how to hardcode library paths into programs...
immediate
checking whether stripping libraries is possible...
yes
checking if libtool supports shared libraries...
yes
checking whether to build shared libraries...
yes
checking whether to build static libraries...
no
creating libtool
appending configuration tag "CXX" to libtool
configure: patching config.h.in
configure: creating ./config.status
config.status: creating config.h
/bin/bash /tmp/ext-src/trunk/libtool --mode=compile cc -I. -I/tmp/ext-src/trunk -I/tmp/ext-src/trunk/include -I/tmp/ext-src/trunk/main -I/tmp/ext-src/trunk -I/usr/local/include/php -I/usr/local/include/php/main -I/usr/local/include/php/TSRM -I/usr/local/include/php/Zend -I/usr/local/include/php/ext -I/usr/local/include/php/ext/date/lib -I/usr/include/subversion-1 -I/usr/include/apr-1.0 -DLINUX -D_REENTRANT -D_GNU_SOURCE  -DHAVE_CONFIG_H  -g -O2   -I/usr/include/subversion-1  -I/usr/include/apr-1.0   -DLINUX -D_REENTRANT -D_GNU_SOURCE -c /tmp/ext-src/trunk/svn.c -o svn.lo
mkdir .libs
cc -I. -I/tmp/ext-src/trunk -I/tmp/ext-src/trunk/include -I/tmp/ext-src/trunk/main -I/tmp/ext-src/trunk -I/usr/local/include/php -I/usr/local/include/php/main -I/usr/local/include/php/TSRM -I/usr/local/include/php/Zend -I/usr/local/include/php/ext -I/usr/local/include/php/ext/date/lib -I/usr/include/subversion-1 -I/usr/include/apr-1.0 -DLINUX -D_REENTRANT -D_GNU_SOURCE -DHAVE_CONFIG_H -g -O2 -I/usr/include/subversion-1 -I/usr/include/apr-1.0 -DLINUX -D_REENTRANT -D_GNU_SOURCE -c /tmp/ext-src/trunk/svn.c  -fPIC -DPIC -o .libs/svn.o
/tmp/ext-src/trunk/svn.c:296:53: error: expected ';', ',' or ')' before 'TSRMLS_DC'
 static void php_svn_handle_error(svn_error_t *error TSRMLS_DC)
                                                     ^~~~~~~~~

/tmp/ext-src/trunk/svn.c: In function 'php_svn_auth_ssl_client_server_trust_prompter':

/tmp/ext-src/trunk/svn.c:338:2: warning: implicit declaration of function 'TSRMLS_FETCH'; did you mean 'TSRMLS_CACHE'? [-Wimplicit-function-declaration]
  TSRMLS_FETCH();
  ^~~~~~~~~~~~
  TSRMLS_CACHE

/tmp/ext-src/trunk/svn.c: In function 'init_svn_client':

/tmp/ext-src/trunk/svn.c:363:12: warning: type of 'TSRMLS_D' defaults to 'int' [-Wimplicit-int]
 static int init_svn_client(TSRMLS_D)
            ^~~~~~~~~~~~~~~

/tmp/ext-src/trunk/svn.c:374:2: warning: 'svn_client_create_context' is deprecated [-Wdeprecated-declarations]
  if ((err = svn_client_create_context (&SVN_G(ctx), SVN_G(pool)))) {
  ^~

In file included from /tmp/ext-src/trunk/php_svn.h:43,
                 from /tmp/ext-src/trunk/svn.c:33:
/usr/include/subversion-1/svn_client.h:1079:1: note: declared here
 svn_client_create_context(svn_client_ctx_t **ctx,
 ^~~~~~~~~~~~~~~~~~~~~~~~~

/tmp/ext-src/trunk/svn.c:375:3: warning: implicit declaration of function 'php_svn_handle_error'; did you mean 'svn_handle_error'? [-Wimplicit-function-declaration]
   php_svn_handle_error(err TSRMLS_CC);
   ^~~~~~~~~~~~~~~~~~~~
   svn_handle_error

/tmp/ext-src/trunk/svn.c:375:27: error: expected ')' before 'TSRMLS_CC'
   php_svn_handle_error(err TSRMLS_CC);
                           ^~~~~~~~~~
                           )

/tmp/ext-src/trunk/svn.c:386:28: error: expected ')' before 'TSRMLS_CC'
    php_svn_handle_error(err TSRMLS_CC);
                            ^~~~~~~~~~
                            )

/tmp/ext-src/trunk/svn.c:401:2: warning: 'svn_client_get_simple_provider' is deprecated [-Wdeprecated-declarations]
  svn_client_get_simple_provider (&provider, SVN_G(pool));
  ^~~~~~~~~~~~~~~~~~~~~~~~~~~~~~

In file included from /tmp/ext-src/trunk/php_svn.h:43,
                 from /tmp/ext-src/trunk/svn.c:33:
/usr/include/subversion-1/svn_client.h:151:1: note: declared here
 svn_client_get_simple_provider(svn_auth_provider_object_t **provider,
 ^~~~~~~~~~~~~~~~~~~~~~~~~~~~~~

/tmp/ext-src/trunk/svn.c:404:2: warning: 'svn_client_get_username_provider' is deprecated [-Wdeprecated-declarations]
  svn_client_get_username_provider (&provider, SVN_G(pool));
  ^~~~~~~~~~~~~~~~~~~~~~~~~~~~~~~~

In file included from /tmp/ext-src/trunk/php_svn.h:43,
                 from /tmp/ext-src/trunk/svn.c:33:
/usr/include/subversion-1/svn_client.h:198:1: note: declared here
 svn_client_get_username_provider(svn_auth_provider_object_t **provider,
 ^~~~~~~~~~~~~~~~~~~~~~~~~~~~~~~~

/tmp/ext-src/trunk/svn.c:407:2: warning: 'svn_client_get_ssl_server_trust_prompt_provider' is deprecated [-Wdeprecated-declarations]
  svn_client_get_ssl_server_trust_prompt_provider (&provider, php_svn_auth_ssl_client_server_trust_prompter, NULL, SVN_G(pool));
  ^~~~~~~~~~~~~~~~~~~~~~~~~~~~~~~~~~~~~~~~~~~~~~~

In file included from /tmp/ext-src/trunk/php_svn.h:43,
                 from /tmp/ext-src/trunk/svn.c:33:
/usr/include/subversion-1/svn_client.h:265:1: note: declared here
 svn_client_get_ssl_server_trust_prompt_provider(
 ^~~~~~~~~~~~~~~~~~~~~~~~~~~~~~~~~~~~~~~~~~~~~~~

/tmp/ext-src/trunk/svn.c:411:2: warning: 'svn_client_get_ssl_server_trust_file_provider' is deprecated [-Wdeprecated-declarations]
  svn_client_get_ssl_server_trust_file_provider (&provider, SVN_G(pool));
  ^~~~~~~~~~~~~~~~~~~~~~~~~~~~~~~~~~~~~~~~~~~~~

In file included from /tmp/ext-src/trunk/php_svn.h:43,
                 from /tmp/ext-src/trunk/svn.c:33:
/usr/include/subversion-1/svn_client.h:214:1: note: declared here
 svn_client_get_ssl_server_trust_file_provider(
 ^~~~~~~~~~~~~~~~~~~~~~~~~~~~~~~~~~~~~~~~~~~~~

/tmp/ext-src/trunk/svn.c:414:2: warning: 'svn_client_get_ssl_client_cert_file_provider' is deprecated [-Wdeprecated-declarations]
  svn_client_get_ssl_client_cert_file_provider (&provider, SVN_G(pool));
  ^~~~~~~~~~~~~~~~~~~~~~~~~~~~~~~~~~~~~~~~~~~~

In file included from /tmp/ext-src/trunk/php_svn.h:43,
                 from /tmp/ext-src/trunk/svn.c:33:
/usr/include/subversion-1/svn_client.h:231:1: note: declared here
 svn_client_get_ssl_client_cert_file_provider(
 ^~~~~~~~~~~~~~~~~~~~~~~~~~~~~~~~~~~~~~~~~~~~

/tmp/ext-src/trunk/svn.c:417:2: warning: 'svn_client_get_ssl_client_cert_pw_file_provider' is deprecated [-Wdeprecated-declarations]
  svn_client_get_ssl_client_cert_pw_file_provider (&provider, SVN_G(pool));
  ^~~~~~~~~~~~~~~~~~~~~~~~~~~~~~~~~~~~~~~~~~~~~~~

In file included from /tmp/ext-src/trunk/php_svn.h:43,
                 from /tmp/ext-src/trunk/svn.c:33:
/usr/include/subversion-1/svn_client.h:248:1: note: declared here
 svn_client_get_ssl_client_cert_pw_file_provider(
 ^~~~~~~~~~~~~~~~~~~~~~~~~~~~~~~~~~~~~~~~~~~~~~~

/tmp/ext-src/trunk/svn.c: In function 'zif_svn_auth_get_parameter':

/tmp/ext-src/trunk/svn.c:438:55: error: expected ')' before 'TSRMLS_CC'
  if (FAILURE == zend_parse_parameters(ZEND_NUM_ARGS() TSRMLS_CC, "s", &key, &keylen)) {
                                                       ^~~~~~~~~

/tmp/ext-src/trunk/svn.c:438:17: error: too few arguments to function 'zend_parse_parameters'
  if (FAILURE == zend_parse_parameters(ZEND_NUM_ARGS() TSRMLS_CC, "s", &key, &keylen)) {
                 ^~~~~~~~~~~~~~~~~~~~~

In file included from /usr/local/include/php/main/php.h:35,
                 from /tmp/ext-src/trunk/svn.c:30:
/usr/local/include/php/Zend/zend_API.h:304:22: note: declared here
 ZEND_API zend_result zend_parse_parameters(uint32_t num_args, const char *type_spec, ...);
                      ^~~~~~~~~~~~~~~~~~~~~

/tmp/ext-src/trunk/svn.c:55:23: error: 'TSRMLS_C' undeclared (first use in this function); did you mean 'TSRM_H'?
   if (init_svn_client(TSRMLS_C)) RETURN_FALSE; \
                       ^~~~~~~~
/tmp/ext-src/trunk/svn.c:442:2: note: in expansion of macro 'PHP_SVN_INIT_CLIENT'
  PHP_SVN_INIT_CLIENT();
  ^~~~~~~~~~~~~~~~~~~

/tmp/ext-src/trunk/svn.c:55:23: note: each undeclared identifier is reported only once for each function it appears in
   if (init_svn_client(TSRMLS_C)) RETURN_FALSE; \
                       ^~~~~~~~
/tmp/ext-src/trunk/svn.c:442:2: note: in expansion of macro 'PHP_SVN_INIT_CLIENT'
  PHP_SVN_INIT_CLIENT();
  ^~~~~~~~~~~~~~~~~~~

/tmp/ext-src/trunk/svn.c: In function 'zif_svn_auth_set_parameter':

/tmp/ext-src/trunk/svn.c:460:55: error: expected ')' before 'TSRMLS_CC'
  if (FAILURE == zend_parse_parameters(ZEND_NUM_ARGS() TSRMLS_CC, "sz", &key, &keylen, &value)) {
                                                       ^~~~~~~~~

/tmp/ext-src/trunk/svn.c:460:17: error: too few arguments to function 'zend_parse_parameters'
  if (FAILURE == zend_parse_parameters(ZEND_NUM_ARGS() TSRMLS_CC, "sz", &key, &keylen, &value)) {
                 ^~~~~~~~~~~~~~~~~~~~~

In file included from /usr/local/include/php/main/php.h:35,
                 from /tmp/ext-src/trunk/svn.c:30:
/usr/local/include/php/Zend/zend_API.h:304:22: note: declared here
 ZEND_API zend_result zend_parse_parameters(uint32_t num_args, const char *type_spec, ...);
                      ^~~~~~~~~~~~~~~~~~~~~

/tmp/ext-src/trunk/svn.c:55:23: error: 'TSRMLS_C' undeclared (first use in this function); did you mean 'TSRM_H'?
   if (init_svn_client(TSRMLS_C)) RETURN_FALSE; \
                       ^~~~~~~~
/tmp/ext-src/trunk/svn.c:463:2: note: in expansion of macro 'PHP_SVN_INIT_CLIENT'
  PHP_SVN_INIT_CLIENT();
  ^~~~~~~~~~~~~~~~~~~

/tmp/ext-src/trunk/svn.c: In function 'zif_svn_config_ensure':

/tmp/ext-src/trunk/svn.c:490:55: error: expected ')' before 'TSRMLS_CC'
  if (FAILURE == zend_parse_parameters(ZEND_NUM_ARGS() TSRMLS_CC, "s!", &config_path, &config_path_len)) {
                                                       ^~~~~~~~~

/tmp/ext-src/trunk/svn.c:490:17: error: too few arguments to function 'zend_parse_parameters'
  if (FAILURE == zend_parse_parameters(ZEND_NUM_ARGS() TSRMLS_CC, "s!", &config_path, &config_path_len)) {
                 ^~~~~~~~~~~~~~~~~~~~~

In file included from /usr/local/include/php/main/php.h:35,
                 from /tmp/ext-src/trunk/svn.c:30:
/usr/local/include/php/Zend/zend_API.h:304:22: note: declared here
 ZEND_API zend_result zend_parse_parameters(uint32_t num_args, const char *type_spec, ...);
                      ^~~~~~~~~~~~~~~~~~~~~

/tmp/ext-src/trunk/svn.c:55:23: error: 'TSRMLS_C' undeclared (first use in this function); did you mean 'TSRM_H'?
   if (init_svn_client(TSRMLS_C)) RETURN_FALSE; \
                       ^~~~~~~~
/tmp/ext-src/trunk/svn.c:494:2: note: in expansion of macro 'PHP_SVN_INIT_CLIENT'
  PHP_SVN_INIT_CLIENT();
  ^~~~~~~~~~~~~~~~~~~

/tmp/ext-src/trunk/svn.c:504:28: error: expected ')' before 'TSRMLS_CC'
    php_svn_handle_error(err TSRMLS_CC);
                            ^~~~~~~~~~
                            )

/tmp/ext-src/trunk/svn.c:509:3: warning: 'svn_path_canonicalize' is deprecated [-Wdeprecated-declarations]
   config_path = svn_path_canonicalize(utf8_path, subpool);
   ^~~~~~~~~~~

In file included from /tmp/ext-src/trunk/svn.c:40:
/usr/include/subversion-1/svn_path.h:284:1: note: declared here
 svn_path_canonicalize(const char *path, apr_pool_t *pool);
 ^~~~~~~~~~~~~~~~~~~~~

/tmp/ext-src/trunk/svn.c: In function 'zif_svn_import':

/tmp/ext-src/trunk/svn.c:538:55: error: expected ')' before 'TSRMLS_CC'
  if (FAILURE == zend_parse_parameters(ZEND_NUM_ARGS() TSRMLS_CC, "ssb",
                                                       ^~~~~~~~~

/tmp/ext-src/trunk/svn.c:538:17: error: too few arguments to function 'zend_parse_parameters'
  if (FAILURE == zend_parse_parameters(ZEND_NUM_ARGS() TSRMLS_CC, "ssb",
                 ^~~~~~~~~~~~~~~~~~~~~

In file included from /usr/local/include/php/main/php.h:35,
                 from /tmp/ext-src/trunk/svn.c:30:
/usr/local/include/php/Zend/zend_API.h:304:22: note: declared here
 ZEND_API zend_result zend_parse_parameters(uint32_t num_args, const char *type_spec, ...);
                      ^~~~~~~~~~~~~~~~~~~~~

/tmp/ext-src/trunk/svn.c:55:23: error: 'TSRMLS_C' undeclared (first use in this function); did you mean 'TSRM_H'?
   if (init_svn_client(TSRMLS_C)) RETURN_FALSE; \
                       ^~~~~~~~
/tmp/ext-src/trunk/svn.c:543:2: note: in expansion of macro 'PHP_SVN_INIT_CLIENT'
  PHP_SVN_INIT_CLIENT();
  ^~~~~~~~~~~~~~~~~~~

/tmp/ext-src/trunk/svn.c:552:27: error: expected ')' before 'TSRMLS_CC'
   php_svn_handle_error(err TSRMLS_CC);
                           ^~~~~~~~~~
                           )

/tmp/ext-src/trunk/svn.c:557:2: warning: 'svn_path_canonicalize' is deprecated [-Wdeprecated-declarations]
  path = svn_path_canonicalize(utf8_path, subpool);
  ^~~~

In file included from /tmp/ext-src/trunk/svn.c:40:
/usr/include/subversion-1/svn_path.h:284:1: note: declared here
 svn_path_canonicalize(const char *path, apr_pool_t *pool);
 ^~~~~~~~~~~~~~~~~~~~~

/tmp/ext-src/trunk/svn.c:559:2: warning: 'svn_client_import' is deprecated [-Wdeprecated-declarations]
  err = svn_client_import(&commit_info_p, path, url, nonrecursive,
  ^~~

In file included from /tmp/ext-src/trunk/php_svn.h:43,
                 from /tmp/ext-src/trunk/svn.c:33:
/usr/include/subversion-1/svn_client.h:2074:1: note: declared here
 svn_client_import(svn_client_commit_info_t **commit_info_p,
 ^~~~~~~~~~~~~~~~~

/tmp/ext-src/trunk/svn.c:562:28: error: expected ')' before 'TSRMLS_CC'
   php_svn_handle_error (err TSRMLS_CC);
                            ^~~~~~~~~~
                            )

/tmp/ext-src/trunk/svn.c: In function 'zm_startup_svn':

/tmp/ext-src/trunk/svn.c:587:25: error: expected ')' before 'TSRMLS_CC'
   php_error_docref(NULL TSRMLS_CC, E_WARNING, "libsvn was compiled against a newer version of APR than was loaded");
                         ^~~~~~~~~

/tmp/ext-src/trunk/svn.c:587:3: error: too few arguments to function 'php_error_docref'
   php_error_docref(NULL TSRMLS_CC, E_WARNING, "libsvn was compiled against a newer version of APR than was loaded");
   ^~~~~~~~~~~~~~~~

In file included from /tmp/ext-src/trunk/svn.c:30:
/usr/local/include/php/main/php.h:341:23: note: declared here
 PHPAPI ZEND_COLD void php_error_docref(const char *docref, int type, const char *format, ...)
                       ^~~~~~~~~~~~~~~~

/tmp/ext-src/trunk/svn.c:593:43: error: expected ')' before 'TSRMLS_CC'
  ce_Svn = zend_register_internal_class(&ce TSRMLS_CC);
                                           ^~~~~~~~~~
                                           )

/tmp/ext-src/trunk/svn.c:596:45: error: expected ')' before 'TSRMLS_CC'
  ce_SvnWc = zend_register_internal_class(&ce TSRMLS_CC);
                                             ^~~~~~~~~~
                                             )

/tmp/ext-src/trunk/svn.c:599:53: error: expected ')' before 'TSRMLS_CC'
  ce_SvnWcSchedule = zend_register_internal_class(&ce TSRMLS_CC);
                                                     ^~~~~~~~~~
                                                     )

/tmp/ext-src/trunk/svn.c:602:47: error: expected ')' before 'TSRMLS_CC'
  ce_SvnNode = zend_register_internal_class(&ce TSRMLS_CC);
                                               ^~~~~~~~~~
                                               )

/tmp/ext-src/trunk/svn.c:607:38: error: expected ')' before 'TSRMLS_CC'
    sizeof(const_name)-1, (long)value TSRMLS_CC);
                                      ^~~~~~~~~
/tmp/ext-src/trunk/svn.c:609:2: note: in expansion of macro 'CLASS_CONST_LONG'
  CLASS_CONST_LONG(Svn, "NON_RECURSIVE", SVN_NON_RECURSIVE);
  ^~~~~~~~~~~~~~~~

/tmp/ext-src/trunk/svn.c:607:38: error: expected ')' before 'TSRMLS_CC'
    sizeof(const_name)-1, (long)value TSRMLS_CC);
                                      ^~~~~~~~~
/tmp/ext-src/trunk/svn.c:610:2: note: in expansion of macro 'CLASS_CONST_LONG'
  CLASS_CONST_LONG(Svn, "DISCOVER_CHANGED_PATHS", SVN_DISCOVER_CHANGED_PATHS);
  ^~~~~~~~~~~~~~~~

/tmp/ext-src/trunk/svn.c:607:38: error: expected ')' before 'TSRMLS_CC'
    sizeof(const_name)-1, (long)value TSRMLS_CC);
                                      ^~~~~~~~~
/tmp/ext-src/trunk/svn.c:611:2: note: in expansion of macro 'CLASS_CONST_LONG'
  CLASS_CONST_LONG(Svn, "OMIT_MESSAGES", SVN_OMIT_MESSAGES);
  ^~~~~~~~~~~~~~~~

/tmp/ext-src/trunk/svn.c:607:38: error: expected ')' before 'TSRMLS_CC'
    sizeof(const_name)-1, (long)value TSRMLS_CC);
                                      ^~~~~~~~~
/tmp/ext-src/trunk/svn.c:612:2: note: in expansion of macro 'CLASS_CONST_LONG'
  CLASS_CONST_LONG(Svn, "STOP_ON_COPY", SVN_STOP_ON_COPY);
  ^~~~~~~~~~~~~~~~

/tmp/ext-src/trunk/svn.c:607:38: error: expected ')' before 'TSRMLS_CC'
    sizeof(const_name)-1, (long)value TSRMLS_CC);
                                      ^~~~~~~~~
/tmp/ext-src/trunk/svn.c:613:2: note: in expansion of macro 'CLASS_CONST_LONG'
  CLASS_CONST_LONG(Svn, "ALL", SVN_ALL);
  ^~~~~~~~~~~~~~~~

/tmp/ext-src/trunk/svn.c:607:38: error: expected ')' before 'TSRMLS_CC'
    sizeof(const_name)-1, (long)value TSRMLS_CC);
                                      ^~~~~~~~~
/tmp/ext-src/trunk/svn.c:614:2: note: in expansion of macro 'CLASS_CONST_LONG'
  CLASS_CONST_LONG(Svn, "SHOW_UPDATES", SVN_SHOW_UPDATES);
  ^~~~~~~~~~~~~~~~

/tmp/ext-src/trunk/svn.c:607:38: error: expected ')' before 'TSRMLS_CC'
    sizeof(const_name)-1, (long)value TSRMLS_CC);
                                      ^~~~~~~~~
/tmp/ext-src/trunk/svn.c:615:2: note: in expansion of macro 'CLASS_CONST_LONG'
  CLASS_CONST_LONG(Svn, "NO_IGNORE", SVN_NO_IGNORE);
  ^~~~~~~~~~~~~~~~

/tmp/ext-src/trunk/svn.c:607:38: error: expected ')' before 'TSRMLS_CC'
    sizeof(const_name)-1, (long)value TSRMLS_CC);
                                      ^~~~~~~~~
/tmp/ext-src/trunk/svn.c:616:2: note: in expansion of macro 'CLASS_CONST_LONG'
  CLASS_CONST_LONG(Svn, "IGNORE_EXTERNALS", SVN_IGNORE_EXTERNALS);
  ^~~~~~~~~~~~~~~~

/tmp/ext-src/trunk/svn.c:607:38: error: expected ')' before 'TSRMLS_CC'
    sizeof(const_name)-1, (long)value TSRMLS_CC);
                                      ^~~~~~~~~
/tmp/ext-src/trunk/svn.c:618:2: note: in expansion of macro 'CLASS_CONST_LONG'
  CLASS_CONST_LONG(Svn, "INITIAL", SVN_REVISION_INITIAL);
  ^~~~~~~~~~~~~~~~

/tmp/ext-src/trunk/svn.c:607:38: error: expected ')' before 'TSRMLS_CC'
    sizeof(const_name)-1, (long)value TSRMLS_CC);
                                      ^~~~~~~~~
/tmp/ext-src/trunk/svn.c:619:2: note: in expansion of macro 'CLASS_CONST_LONG'
  CLASS_CONST_LONG(Svn, "HEAD", SVN_REVISION_HEAD);
  ^~~~~~~~~~~~~~~~

/tmp/ext-src/trunk/svn.c:607:38: error: expected ')' before 'TSRMLS_CC'
    sizeof(const_name)-1, (long)value TSRMLS_CC);
                                      ^~~~~~~~~
/tmp/ext-src/trunk/svn.c:620:2: note: in expansion of macro 'CLASS_CONST_LONG'
  CLASS_CONST_LONG(Svn, "BASE", SVN_REVISION_BASE);
  ^~~~~~~~~~~~~~~~

/tmp/ext-src/trunk/svn.c:607:38: error: expected ')' before 'TSRMLS_CC'
    sizeof(const_name)-1, (long)value TSRMLS_CC);
                                      ^~~~~~~~~
/tmp/ext-src/trunk/svn.c:621:2: note: in expansion of macro 'CLASS_CONST_LONG'
  CLASS_CONST_LONG(Svn, "COMMITTED", SVN_REVISION_COMMITTED);
  ^~~~~~~~~~~~~~~~

/tmp/ext-src/trunk/svn.c:607:38: error: expected ')' before 'TSRMLS_CC'
    sizeof(const_name)-1, (long)value TSRMLS_CC);
                                      ^~~~~~~~~
/tmp/ext-src/trunk/svn.c:622:2: note: in expansion of macro 'CLASS_CONST_LONG'
  CLASS_CONST_LONG(Svn, "PREV", SVN_REVISION_PREV);
  ^~~~~~~~~~~~~~~~

/tmp/ext-src/trunk/svn.c:607:38: error: expected ')' before 'TSRMLS_CC'
    sizeof(const_name)-1, (long)value TSRMLS_CC);
                                      ^~~~~~~~~
/tmp/ext-src/trunk/svn.c:623:2: note: in expansion of macro 'CLASS_CONST_LONG'
  CLASS_CONST_LONG(Svn, "UNSPECIFIED", SVN_REVISION_UNSPECIFIED);
  ^~~~~~~~~~~~~~~~

/tmp/ext-src/trunk/svn.c:607:38: error: expected ')' before 'TSRMLS_CC'
    sizeof(const_name)-1, (long)value TSRMLS_CC);
                                      ^~~~~~~~~
/tmp/ext-src/trunk/svn.c:626:2: note: in expansion of macro 'CLASS_CONST_LONG'
  CLASS_CONST_LONG(Svn, "DEPTH_UNKNOWN", svn_depth_unknown);
  ^~~~~~~~~~~~~~~~

/tmp/ext-src/trunk/svn.c:607:38: error: expected ')' before 'TSRMLS_CC'
    sizeof(const_name)-1, (long)value TSRMLS_CC);
                                      ^~~~~~~~~
/tmp/ext-src/trunk/svn.c:627:2: note: in expansion of macro 'CLASS_CONST_LONG'
  CLASS_CONST_LONG(Svn, "DEPTH_EXCLUDE", svn_depth_exclude);
  ^~~~~~~~~~~~~~~~

/tmp/ext-src/trunk/svn.c:607:38: error: expected ')' before 'TSRMLS_CC'
    sizeof(const_name)-1, (long)value TSRMLS_CC);
                                      ^~~~~~~~~
/tmp/ext-src/trunk/svn.c:628:2: note: in expansion of macro 'CLASS_CONST_LONG'
  CLASS_CONST_LONG(Svn, "DEPTH_EMPTY", svn_depth_empty);
  ^~~~~~~~~~~~~~~~

/tmp/ext-src/trunk/svn.c:607:38: error: expected ')' before 'TSRMLS_CC'
    sizeof(const_name)-1, (long)value TSRMLS_CC);
                                      ^~~~~~~~~
/tmp/ext-src/trunk/svn.c:629:2: note: in expansion of macro 'CLASS_CONST_LONG'
  CLASS_CONST_LONG(Svn, "DEPTH_FILES", svn_depth_files);
  ^~~~~~~~~~~~~~~~

/tmp/ext-src/trunk/svn.c:607:38: error: expected ')' before 'TSRMLS_CC'
    sizeof(const_name)-1, (long)value TSRMLS_CC);
                                      ^~~~~~~~~
/tmp/ext-src/trunk/svn.c:630:2: note: in expansion of macro 'CLASS_CONST_LONG'
  CLASS_CONST_LONG(Svn, "DEPTH_IMMEDIATES", svn_depth_immediates);
  ^~~~~~~~~~~~~~~~

/tmp/ext-src/trunk/svn.c:607:38: error: expected ')' before 'TSRMLS_CC'
    sizeof(const_name)-1, (long)value TSRMLS_CC);
                                      ^~~~~~~~~
/tmp/ext-src/trunk/svn.c:631:2: note: in expansion of macro 'CLASS_CONST_LONG'
  CLASS_CONST_LONG(Svn, "DEPTH_INFINITY", svn_depth_infinity);
  ^~~~~~~~~~~~~~~~

/tmp/ext-src/trunk/svn.c:607:38: error: expected ')' before 'TSRMLS_CC'
    sizeof(const_name)-1, (long)value TSRMLS_CC);
                                      ^~~~~~~~~
/tmp/ext-src/trunk/svn.c:634:2: note: in expansion of macro 'CLASS_CONST_LONG'
  CLASS_CONST_LONG(SvnWc, "NONE", svn_wc_status_none);
  ^~~~~~~~~~~~~~~~

/tmp/ext-src/trunk/svn.c:607:38: error: expected ')' before 'TSRMLS_CC'
    sizeof(const_name)-1, (long)value TSRMLS_CC);
                                      ^~~~~~~~~
/tmp/ext-src/trunk/svn.c:635:2: note: in expansion of macro 'CLASS_CONST_LONG'
  CLASS_CONST_LONG(SvnWc, "UNVERSIONED", svn_wc_status_unversioned);
  ^~~~~~~~~~~~~~~~

/tmp/ext-src/trunk/svn.c:607:38: error: expected ')' before 'TSRMLS_CC'
    sizeof(const_name)-1, (long)value TSRMLS_CC);
                                      ^~~~~~~~~
/tmp/ext-src/trunk/svn.c:636:2: note: in expansion of macro 'CLASS_CONST_LONG'
  CLASS_CONST_LONG(SvnWc, "NORMAL", svn_wc_status_normal);
  ^~~~~~~~~~~~~~~~

/tmp/ext-src/trunk/svn.c:607:38: error: expected ')' before 'TSRMLS_CC'
    sizeof(const_name)-1, (long)value TSRMLS_CC);
                                      ^~~~~~~~~
/tmp/ext-src/trunk/svn.c:637:2: note: in expansion of macro 'CLASS_CONST_LONG'
  CLASS_CONST_LONG(SvnWc, "ADDED", svn_wc_status_added);
  ^~~~~~~~~~~~~~~~

/tmp/ext-src/trunk/svn.c:607:38: error: expected ')' before 'TSRMLS_CC'
    sizeof(const_name)-1, (long)value TSRMLS_CC);
                                      ^~~~~~~~~
/tmp/ext-src/trunk/svn.c:638:2: note: in expansion of macro 'CLASS_CONST_LONG'
  CLASS_CONST_LONG(SvnWc, "MISSING", svn_wc_status_missing);
  ^~~~~~~~~~~~~~~~

/tmp/ext-src/trunk/svn.c:607:38: error: expected ')' before 'TSRMLS_CC'
    sizeof(const_name)-1, (long)value TSRMLS_CC);
                                      ^~~~~~~~~
/tmp/ext-src/trunk/svn.c:639:2: note: in expansion of macro 'CLASS_CONST_LONG'
  CLASS_CONST_LONG(SvnWc, "DELETED", svn_wc_status_deleted);
  ^~~~~~~~~~~~~~~~

/tmp/ext-src/trunk/svn.c:607:38: error: expected ')' before 'TSRMLS_CC'
    sizeof(const_name)-1, (long)value TSRMLS_CC);
                                      ^~~~~~~~~
/tmp/ext-src/trunk/svn.c:640:2: note: in expansion of macro 'CLASS_CONST_LONG'
  CLASS_CONST_LONG(SvnWc, "REPLACED", svn_wc_status_replaced);
  ^~~~~~~~~~~~~~~~

/tmp/ext-src/trunk/svn.c:607:38: error: expected ')' before 'TSRMLS_CC'
    sizeof(const_name)-1, (long)value TSRMLS_CC);
                                      ^~~~~~~~~
/tmp/ext-src/trunk/svn.c:641:2: note: in expansion of macro 'CLASS_CONST_LONG'
  CLASS_CONST_LONG(SvnWc, "MODIFIED", svn_wc_status_modified);
  ^~~~~~~~~~~~~~~~

/tmp/ext-src/trunk/svn.c:607:38: error: expected ')' before 'TSRMLS_CC'
    sizeof(const_name)-1, (long)value TSRMLS_CC);
                                      ^~~~~~~~~
/tmp/ext-src/trunk/svn.c:642:2: note: in expansion of macro 'CLASS_CONST_LONG'
  CLASS_CONST_LONG(SvnWc, "MERGED", svn_wc_status_merged);
  ^~~~~~~~~~~~~~~~

/tmp/ext-src/trunk/svn.c:607:38: error: expected ')' before 'TSRMLS_CC'
    sizeof(const_name)-1, (long)value TSRMLS_CC);
                                      ^~~~~~~~~
/tmp/ext-src/trunk/svn.c:643:2: note: in expansion of macro 'CLASS_CONST_LONG'
  CLASS_CONST_LONG(SvnWc, "CONFLICTED", svn_wc_status_conflicted);
  ^~~~~~~~~~~~~~~~

/tmp/ext-src/trunk/svn.c:607:38: error: expected ')' before 'TSRMLS_CC'
    sizeof(const_name)-1, (long)value TSRMLS_CC);
                                      ^~~~~~~~~
/tmp/ext-src/trunk/svn.c:644:2: note: in expansion of macro 'CLASS_CONST_LONG'
  CLASS_CONST_LONG(SvnWc, "IGNORED", svn_wc_status_ignored);
  ^~~~~~~~~~~~~~~~

/tmp/ext-src/trunk/svn.c:607:38: error: expected ')' before 'TSRMLS_CC'
    sizeof(const_name)-1, (long)value TSRMLS_CC);
                                      ^~~~~~~~~
/tmp/ext-src/trunk/svn.c:645:2: note: in expansion of macro 'CLASS_CONST_LONG'
  CLASS_CONST_LONG(SvnWc, "OBSTRUCTED", svn_wc_status_obstructed);
  ^~~~~~~~~~~~~~~~

/tmp/ext-src/trunk/svn.c:607:38: error: expected ')' before 'TSRMLS_CC'
    sizeof(const_name)-1, (long)value TSRMLS_CC);
                                      ^~~~~~~~~
/tmp/ext-src/trunk/svn.c:646:2: note: in expansion of macro 'CLASS_CONST_LONG'
  CLASS_CONST_LONG(SvnWc, "EXTERNAL", svn_wc_status_external);
  ^~~~~~~~~~~~~~~~

/tmp/ext-src/trunk/svn.c:607:38: error: expected ')' before 'TSRMLS_CC'
    sizeof(const_name)-1, (long)value TSRMLS_CC);
                                      ^~~~~~~~~
/tmp/ext-src/trunk/svn.c:647:2: note: in expansion of macro 'CLASS_CONST_LONG'
  CLASS_CONST_LONG(SvnWc, "INCOMPLETE", svn_wc_status_incomplete);
  ^~~~~~~~~~~~~~~~

/tmp/ext-src/trunk/svn.c:607:38: error: expected ')' before 'TSRMLS_CC'
    sizeof(const_name)-1, (long)value TSRMLS_CC);
                                      ^~~~~~~~~
/tmp/ext-src/trunk/svn.c:649:2: note: in expansion of macro 'CLASS_CONST_LONG'
  CLASS_CONST_LONG(SvnWcSchedule, "NORMAL", svn_wc_schedule_normal);
  ^~~~~~~~~~~~~~~~

/tmp/ext-src/trunk/svn.c:607:38: error: expected ')' before 'TSRMLS_CC'
    sizeof(const_name)-1, (long)value TSRMLS_CC);
                                      ^~~~~~~~~
/tmp/ext-src/trunk/svn.c:650:2: note: in expansion of macro 'CLASS_CONST_LONG'
  CLASS_CONST_LONG(SvnWcSchedule, "ADD", svn_wc_schedule_add);
  ^~~~~~~~~~~~~~~~

/tmp/ext-src/trunk/svn.c:607:38: error: expected ')' before 'TSRMLS_CC'
    sizeof(const_name)-1, (long)value TSRMLS_CC);
                                      ^~~~~~~~~
/tmp/ext-src/trunk/svn.c:651:2: note: in expansion of macro 'CLASS_CONST_LONG'
  CLASS_CONST_LONG(SvnWcSchedule, "DELETE", svn_wc_schedule_delete);
  ^~~~~~~~~~~~~~~~

/tmp/ext-src/trunk/svn.c:607:38: error: expected ')' before 'TSRMLS_CC'
    sizeof(const_name)-1, (long)value TSRMLS_CC);
                                      ^~~~~~~~~
/tmp/ext-src/trunk/svn.c:652:2: note: in expansion of macro 'CLASS_CONST_LONG'
  CLASS_CONST_LONG(SvnWcSchedule, "REPLACE", svn_wc_schedule_replace);
  ^~~~~~~~~~~~~~~~

/tmp/ext-src/trunk/svn.c:607:38: error: expected ')' before 'TSRMLS_CC'
    sizeof(const_name)-1, (long)value TSRMLS_CC);
                                      ^~~~~~~~~
/tmp/ext-src/trunk/svn.c:654:2: note: in expansion of macro 'CLASS_CONST_LONG'
  CLASS_CONST_LONG(SvnNode, "NONE", svn_node_none);
  ^~~~~~~~~~~~~~~~

/tmp/ext-src/trunk/svn.c:607:38: error: expected ')' before 'TSRMLS_CC'
    sizeof(const_name)-1, (long)value TSRMLS_CC);
                                      ^~~~~~~~~
/tmp/ext-src/trunk/svn.c:655:2: note: in expansion of macro 'CLASS_CONST_LONG'
  CLASS_CONST_LONG(SvnNode, "FILE", svn_node_file);
  ^~~~~~~~~~~~~~~~

/tmp/ext-src/trunk/svn.c:607:38: error: expected ')' before 'TSRMLS_CC'
    sizeof(const_name)-1, (long)value TSRMLS_CC);
                                      ^~~~~~~~~
/tmp/ext-src/trunk/svn.c:656:2: note: in expansion of macro 'CLASS_CONST_LONG'
  CLASS_CONST_LONG(SvnNode, "DIR", svn_node_dir);
  ^~~~~~~~~~~~~~~~

/tmp/ext-src/trunk/svn.c:607:38: error: expected ')' before 'TSRMLS_CC'
    sizeof(const_name)-1, (long)value TSRMLS_CC);
                                      ^~~~~~~~~
/tmp/ext-src/trunk/svn.c:657:2: note: in expansion of macro 'CLASS_CONST_LONG'
  CLASS_CONST_LONG(SvnNode, "UNKNOWN", svn_node_unknown);
  ^~~~~~~~~~~~~~~~

/tmp/ext-src/trunk/svn.c: In function 'zif_svn_checkout':

/tmp/ext-src/trunk/svn.c:791:44: error: expected ')' before 'TSRMLS_CC'
  if (zend_parse_parameters(ZEND_NUM_ARGS() TSRMLS_CC, "ss|lll",
                                            ^~~~~~~~~

/tmp/ext-src/trunk/svn.c:791:6: error: too few arguments to function 'zend_parse_parameters'
  if (zend_parse_parameters(ZEND_NUM_ARGS() TSRMLS_CC, "ss|lll",
      ^~~~~~~~~~~~~~~~~~~~~

In file included from /usr/local/include/php/main/php.h:35,
                 from /tmp/ext-src/trunk/svn.c:30:
/usr/local/include/php/Zend/zend_API.h:304:22: note: declared here
 ZEND_API zend_result zend_parse_parameters(uint32_t num_args, const char *type_spec, ...);
                      ^~~~~~~~~~~~~~~~~~~~~

/tmp/ext-src/trunk/svn.c:55:23: error: 'TSRMLS_C' undeclared (first use in this function); did you mean 'TSRM_H'?
   if (init_svn_client(TSRMLS_C)) RETURN_FALSE; \
                       ^~~~~~~~
/tmp/ext-src/trunk/svn.c:796:2: note: in expansion of macro 'PHP_SVN_INIT_CLIENT'
  PHP_SVN_INIT_CLIENT();
  ^~~~~~~~~~~~~~~~~~~

/tmp/ext-src/trunk/svn.c:804:27: error: expected ')' before 'TSRMLS_CC'
   php_svn_handle_error(err TSRMLS_CC);
                           ^~~~~~~~~~
                           )

/tmp/ext-src/trunk/svn.c:810:27: error: expected ')' before 'TSRMLS_CC'
   php_svn_handle_error(err TSRMLS_CC);
                           ^~~~~~~~~~
                           )

/tmp/ext-src/trunk/svn.c:815:2: warning: 'svn_path_canonicalize' is deprecated [-Wdeprecated-declarations]
  can_repos_url= svn_path_canonicalize(utf8_repos_url, subpool);
  ^~~~~~~~~~~~~

In file included from /tmp/ext-src/trunk/svn.c:40:
/usr/include/subversion-1/svn_path.h:284:1: note: declared here
 svn_path_canonicalize(const char *path, apr_pool_t *pool);
 ^~~~~~~~~~~~~~~~~~~~~

/tmp/ext-src/trunk/svn.c:816:2: warning: 'svn_path_canonicalize' is deprecated [-Wdeprecated-declarations]
  can_target_path = svn_path_canonicalize(utf8_target_path, subpool);
  ^~~~~~~~~~~~~~~

In file included from /tmp/ext-src/trunk/svn.c:40:
/usr/include/subversion-1/svn_path.h:284:1: note: declared here
 svn_path_canonicalize(const char *path, apr_pool_t *pool);
 ^~~~~~~~~~~~~~~~~~~~~

/tmp/ext-src/trunk/svn.c:822:28: error: expected ')' before 'TSRMLS_CC'
   php_svn_handle_error (err TSRMLS_CC);
                            ^~~~~~~~~~
                            )

/tmp/ext-src/trunk/svn.c:856:28: error: expected ')' before 'TSRMLS_CC'
   php_svn_handle_error (err TSRMLS_CC);
                            ^~~~~~~~~~
                            )

/tmp/ext-src/trunk/svn.c: In function 'zif_svn_cat':

/tmp/ext-src/trunk/svn.c:885:44: error: expected ')' before 'TSRMLS_CC'
  if (zend_parse_parameters(ZEND_NUM_ARGS() TSRMLS_CC, "s|l",
                                            ^~~~~~~~~

/tmp/ext-src/trunk/svn.c:885:6: error: too few arguments to function 'zend_parse_parameters'
  if (zend_parse_parameters(ZEND_NUM_ARGS() TSRMLS_CC, "s|l",
      ^~~~~~~~~~~~~~~~~~~~~

In file included from /usr/local/include/php/main/php.h:35,
                 from /tmp/ext-src/trunk/svn.c:30:
/usr/local/include/php/Zend/zend_API.h:304:22: note: declared here
 ZEND_API zend_result zend_parse_parameters(uint32_t num_args, const char *type_spec, ...);
                      ^~~~~~~~~~~~~~~~~~~~~

/tmp/ext-src/trunk/svn.c:55:23: error: 'TSRMLS_C' undeclared (first use in this function); did you mean 'TSRM_H'?
   if (init_svn_client(TSRMLS_C)) RETURN_FALSE; \
                       ^~~~~~~~
/tmp/ext-src/trunk/svn.c:890:2: note: in expansion of macro 'PHP_SVN_INIT_CLIENT'
  PHP_SVN_INIT_CLIENT();
  ^~~~~~~~~~~~~~~~~~~

/tmp/ext-src/trunk/svn.c:902:25: error: expected ')' before 'TSRMLS_CC'
   php_error_docref(NULL TSRMLS_CC, E_WARNING, "failed to allocate stringbuf");
                         ^~~~~~~~~

/tmp/ext-src/trunk/svn.c:902:3: error: too few arguments to function 'php_error_docref'
   php_error_docref(NULL TSRMLS_CC, E_WARNING, "failed to allocate stringbuf");
   ^~~~~~~~~~~~~~~~

In file included from /tmp/ext-src/trunk/svn.c:30:
/usr/local/include/php/main/php.h:341:23: note: declared here
 PHPAPI ZEND_COLD void php_error_docref(const char *docref, int type, const char *format, ...)
                       ^~~~~~~~~~~~~~~~

/tmp/ext-src/trunk/svn.c:908:25: error: expected ')' before 'TSRMLS_CC'
   php_error_docref(NULL TSRMLS_CC, E_WARNING, "failed to create svn stream");
                         ^~~~~~~~~

/tmp/ext-src/trunk/svn.c:908:3: error: too few arguments to function 'php_error_docref'
   php_error_docref(NULL TSRMLS_CC, E_WARNING, "failed to create svn stream");
   ^~~~~~~~~~~~~~~~

In file included from /tmp/ext-src/trunk/svn.c:30:
/usr/local/include/php/main/php.h:341:23: note: declared here
 PHPAPI ZEND_COLD void php_error_docref(const char *docref, int type, const char *format, ...)
                       ^~~~~~~~~~~~~~~~

/tmp/ext-src/trunk/svn.c:914:27: error: expected ')' before 'TSRMLS_CC'
   php_svn_handle_error(err TSRMLS_CC);
                           ^~~~~~~~~~
                           )

/tmp/ext-src/trunk/svn.c:918:2: warning: 'svn_path_canonicalize' is deprecated [-Wdeprecated-declarations]
  url = svn_path_canonicalize(utf8_url, subpool);
  ^~~

In file included from /tmp/ext-src/trunk/svn.c:40:
/usr/include/subversion-1/svn_path.h:284:1: note: declared here
 svn_path_canonicalize(const char *path, apr_pool_t *pool);
 ^~~~~~~~~~~~~~~~~~~~~

/tmp/ext-src/trunk/svn.c:922:27: error: expected ')' before 'TSRMLS_CC'
   php_svn_handle_error(err TSRMLS_CC);
                           ^~~~~~~~~~
                           )

/tmp/ext-src/trunk/svn.c:926:2: warning: 'svn_client_cat2' is deprecated [-Wdeprecated-declarations]
  err = svn_client_cat2(out, true_path, &peg_revision, &revision, SVN_G(ctx), subpool);
  ^~~

In file included from /tmp/ext-src/trunk/php_svn.h:43,
                 from /tmp/ext-src/trunk/svn.c:33:
/usr/include/subversion-1/svn_client.h:6692:1: note: declared here
 svn_client_cat2(svn_stream_t *out,
 ^~~~~~~~~~~~~~~

/tmp/ext-src/trunk/svn.c:929:27: error: expected ')' before 'TSRMLS_CC'
   php_svn_handle_error(err TSRMLS_CC);
                           ^~~~~~~~~~
                           )

/tmp/ext-src/trunk/svn.c:935:2: warning: 'svn_stream_read' is deprecated [-Wdeprecated-declarations]
  err = svn_stream_read(out, retdata, &size);
  ^~~

In file included from /usr/include/subversion-1/svn_wc.h:83,
                 from /usr/include/subversion-1/svn_client.h:44,
                 from /tmp/ext-src/trunk/php_svn.h:43,
                 from /tmp/ext-src/trunk/svn.c:33:
/usr/include/subversion-1/svn_io.h:1338:1: note: declared here
 svn_stream_read(svn_stream_t *stream,
 ^~~~~~~~~~~~~~~

/tmp/ext-src/trunk/svn.c:938:27: error: expected ')' before 'TSRMLS_CC'
   php_svn_handle_error(err TSRMLS_CC);
                           ^~~~~~~~~~
                           )

/tmp/ext-src/trunk/svn.c: In function 'zif_svn_ls':

/tmp/ext-src/trunk/svn.c:980:44: error: expected ')' before 'TSRMLS_CC'
  if (zend_parse_parameters(ZEND_NUM_ARGS() TSRMLS_CC, "s|lbb",
                                            ^~~~~~~~~

/tmp/ext-src/trunk/svn.c:980:6: error: too few arguments to function 'zend_parse_parameters'
  if (zend_parse_parameters(ZEND_NUM_ARGS() TSRMLS_CC, "s|lbb",
      ^~~~~~~~~~~~~~~~~~~~~

In file included from /usr/local/include/php/main/php.h:35,
                 from /tmp/ext-src/trunk/svn.c:30:
/usr/local/include/php/Zend/zend_API.h:304:22: note: declared here
 ZEND_API zend_result zend_parse_parameters(uint32_t num_args, const char *type_spec, ...);
                      ^~~~~~~~~~~~~~~~~~~~~

/tmp/ext-src/trunk/svn.c:55:23: error: 'TSRMLS_C' undeclared (first use in this function); did you mean 'TSRM_H'?
   if (init_svn_client(TSRMLS_C)) RETURN_FALSE; \
                       ^~~~~~~~
/tmp/ext-src/trunk/svn.c:984:2: note: in expansion of macro 'PHP_SVN_INIT_CLIENT'
  PHP_SVN_INIT_CLIENT();
  ^~~~~~~~~~~~~~~~~~~

/tmp/ext-src/trunk/svn.c:992:27: error: expected ')' before 'TSRMLS_CC'
   php_svn_handle_error(err TSRMLS_CC);
                           ^~~~~~~~~~
                           )

/tmp/ext-src/trunk/svn.c:997:2: warning: 'svn_path_canonicalize' is deprecated [-Wdeprecated-declarations]
  repos_url = svn_path_canonicalize(utf8_repos_url, subpool);
  ^~~~~~~~~

In file included from /tmp/ext-src/trunk/svn.c:40:
/usr/include/subversion-1/svn_path.h:284:1: note: declared here
 svn_path_canonicalize(const char *path, apr_pool_t *pool);
 ^~~~~~~~~~~~~~~~~~~~~

/tmp/ext-src/trunk/svn.c:1003:27: error: expected ')' before 'TSRMLS_CC'
   php_svn_handle_error(err TSRMLS_CC);
                           ^~~~~~~~~~
                           )

/tmp/ext-src/trunk/svn.c:1008:2: warning: 'svn_client_ls2' is deprecated [-Wdeprecated-declarations]
  err = svn_client_ls2 (&dirents,
  ^~~

In file included from /tmp/ext-src/trunk/php_svn.h:43,
                 from /tmp/ext-src/trunk/svn.c:33:
/usr/include/subversion-1/svn_client.h:6610:1: note: declared here
 svn_client_ls2(apr_hash_t **dirents,
 ^~~~~~~~~~~~~~

/tmp/ext-src/trunk/svn.c:1016:27: error: expected ')' before 'TSRMLS_CC'
   php_svn_handle_error(err TSRMLS_CC);
                           ^~~~~~~~~~
                           )

/tmp/ext-src/trunk/svn.c:1065:28: error: expected ')' before 'TSRMLS_CC'
    php_svn_handle_error(err TSRMLS_CC);
                            ^~~~~~~~~~
                            )

/tmp/ext-src/trunk/svn.c: In function 'php_svn_log_receiver':

/tmp/ext-src/trunk/svn.c:1162:38: error: 'zend_qsort' undeclared (first use in this function); did you mean 'zend_sort'?
   zend_hash_sort_ex(Z_ARRVAL(paths), zend_qsort, compare_keys_as_paths, 1);
                                      ^~~~~~~~~~
                                      zend_sort

/tmp/ext-src/trunk/svn.c:1162:50: warning: passing argument 3 of 'zend_hash_sort_ex' from incompatible pointer type [-Wincompatible-pointer-types]
   zend_hash_sort_ex(Z_ARRVAL(paths), zend_qsort, compare_keys_as_paths, 1);
                                                  ^~~~~~~~~~~~~~~~~~~~~

In file included from /usr/local/include/php/Zend/zend.h:33,
                 from /usr/local/include/php/main/php.h:31,
                 from /tmp/ext-src/trunk/svn.c:30:
/usr/local/include/php/Zend/zend_hash.h:268:108: note: expected 'bucket_compare_func_t' {aka 'int (*)(struct _Bucket *, struct _Bucket *)'} but argument is of type 'int (*)(const void *, const void *)'
 ZEND_API void  ZEND_FASTCALL zend_hash_sort_ex(HashTable *ht, sort_func_t sort_func, bucket_compare_func_t compare_func, zend_bool renumber);
                                                                                      ~~~~~~~~~~~~~~~~~~~~~~^~~~~~~~~~~~

/tmp/ext-src/trunk/svn.c: In function 'zif_svn_log':

/tmp/ext-src/trunk/svn.c:1193:44: error: expected ')' before 'TSRMLS_CC'
  if (zend_parse_parameters(ZEND_NUM_ARGS() TSRMLS_CC, "s|llll",
                                            ^~~~~~~~~

/tmp/ext-src/trunk/svn.c:1193:6: error: too few arguments to function 'zend_parse_parameters'
  if (zend_parse_parameters(ZEND_NUM_ARGS() TSRMLS_CC, "s|llll",
      ^~~~~~~~~~~~~~~~~~~~~

In file included from /usr/local/include/php/main/php.h:35,
                 from /tmp/ext-src/trunk/svn.c:30:
/usr/local/include/php/Zend/zend_API.h:304:22: note: declared here
 ZEND_API zend_result zend_parse_parameters(uint32_t num_args, const char *type_spec, ...);
                      ^~~~~~~~~~~~~~~~~~~~~

/tmp/ext-src/trunk/svn.c:55:23: error: 'TSRMLS_C' undeclared (first use in this function); did you mean 'TSRM_H'?
   if (init_svn_client(TSRMLS_C)) RETURN_FALSE; \
                       ^~~~~~~~
/tmp/ext-src/trunk/svn.c:1199:2: note: in expansion of macro 'PHP_SVN_INIT_CLIENT'
  PHP_SVN_INIT_CLIENT();
  ^~~~~~~~~~~~~~~~~~~

/tmp/ext-src/trunk/svn.c:1207:27: error: expected ')' before 'TSRMLS_CC'
   php_svn_handle_error(err TSRMLS_CC);
                           ^~~~~~~~~~
                           )

/tmp/ext-src/trunk/svn.c:1226:2: warning: 'svn_path_canonicalize' is deprecated [-Wdeprecated-declarations]
  url = svn_path_canonicalize(utf8_url, subpool);
  ^~~

In file included from /tmp/ext-src/trunk/svn.c:40:
/usr/include/subversion-1/svn_path.h:284:1: note: declared here
 svn_path_canonicalize(const char *path, apr_pool_t *pool);
 ^~~~~~~~~~~~~~~~~~~~~

/tmp/ext-src/trunk/svn.c:1230:27: error: expected ')' before 'TSRMLS_CC'
   php_svn_handle_error(err TSRMLS_CC);
                           ^~~~~~~~~~
                           )

/tmp/ext-src/trunk/svn.c:1242:2: warning: 'svn_client_log3' is deprecated [-Wdeprecated-declarations]
  err = svn_client_log3(
  ^~~

In file included from /tmp/ext-src/trunk/php_svn.h:43,
                 from /tmp/ext-src/trunk/svn.c:33:
/usr/include/subversion-1/svn_client.h:2787:1: note: declared here
 svn_client_log3(const apr_array_header_t *targets,
 ^~~~~~~~~~~~~~~

/tmp/ext-src/trunk/svn.c:1254:27: error: expected ')' before 'TSRMLS_CC'
   php_svn_handle_error(err TSRMLS_CC);
                           ^~~~~~~~~~
                           )

/tmp/ext-src/trunk/svn.c: At top level:

/tmp/ext-src/trunk/svn.c:1264:84: error: expected ';', ',' or ')' before 'TSRMLS_DC'
 static size_t php_apr_file_write(php_stream *stream, const char *buf, size_t count TSRMLS_DC)
                                                                                    ^~~~~~~~~

/tmp/ext-src/trunk/svn.c:1274:77: error: expected ';', ',' or ')' before 'TSRMLS_DC'
 static size_t php_apr_file_read(php_stream *stream, char *buf, size_t count TSRMLS_DC)
                                                                             ^~~~~~~~~

/tmp/ext-src/trunk/svn.c:1286:68: error: expected ';', ',' or ')' before 'TSRMLS_DC'
 static int php_apr_file_close(php_stream *stream, int close_handle TSRMLS_DC)
                                                                    ^~~~~~~~~

/tmp/ext-src/trunk/svn.c:1294:50: error: expected ';', ',' or ')' before 'TSRMLS_DC'
 static int php_apr_file_flush(php_stream *stream TSRMLS_DC)
                                                  ^~~~~~~~~

/tmp/ext-src/trunk/svn.c:1300:93: error: expected ';', ',' or ')' before 'TSRMLS_DC'
 static int php_apr_file_seek(php_stream *stream, off_t offset, int whence, off_t *newoffset TSRMLS_DC)
                                                                                             ^~~~~~~~~

/tmp/ext-src/trunk/svn.c:1313:2: error: 'php_apr_file_write' undeclared here (not in a function); did you mean 'apr_file_write'?
  php_apr_file_write,
  ^~~~~~~~~~~~~~~~~~
  apr_file_write

/tmp/ext-src/trunk/svn.c:1314:2: error: 'php_apr_file_read' undeclared here (not in a function); did you mean 'apr_file_read'?
  php_apr_file_read,
  ^~~~~~~~~~~~~~~~~
  apr_file_read

/tmp/ext-src/trunk/svn.c:1315:2: error: 'php_apr_file_close' undeclared here (not in a function); did you mean 'apr_file_close'?
  php_apr_file_close,
  ^~~~~~~~~~~~~~~~~~
  apr_file_close

/tmp/ext-src/trunk/svn.c:1316:2: error: 'php_apr_file_flush' undeclared here (not in a function); did you mean 'apr_file_flush'?
  php_apr_file_flush,
  ^~~~~~~~~~~~~~~~~~
  apr_file_flush

/tmp/ext-src/trunk/svn.c:1318:2: error: 'php_apr_file_seek' undeclared here (not in a function); did you mean 'apr_file_seek'?
  php_apr_file_seek,
  ^~~~~~~~~~~~~~~~~
  apr_file_seek

/tmp/ext-src/trunk/svn.c: In function 'zif_svn_diff':

/tmp/ext-src/trunk/svn.c:1343:55: error: expected ')' before 'TSRMLS_CC'
  if (FAILURE == zend_parse_parameters(ZEND_NUM_ARGS() TSRMLS_CC, "sl!sl!",
                                                       ^~~~~~~~~

/tmp/ext-src/trunk/svn.c:1343:17: error: too few arguments to function 'zend_parse_parameters'
  if (FAILURE == zend_parse_parameters(ZEND_NUM_ARGS() TSRMLS_CC, "sl!sl!",
                 ^~~~~~~~~~~~~~~~~~~~~

In file included from /usr/local/include/php/main/php.h:35,
                 from /tmp/ext-src/trunk/svn.c:30:
/usr/local/include/php/Zend/zend_API.h:304:22: note: declared here
 ZEND_API zend_result zend_parse_parameters(uint32_t num_args, const char *type_spec, ...);
                      ^~~~~~~~~~~~~~~~~~~~~

/tmp/ext-src/trunk/svn.c:55:23: error: 'TSRMLS_C' undeclared (first use in this function); did you mean 'TSRM_H'?
   if (init_svn_client(TSRMLS_C)) RETURN_FALSE; \
                       ^~~~~~~~
/tmp/ext-src/trunk/svn.c:1349:2: note: in expansion of macro 'PHP_SVN_INIT_CLIENT'
  PHP_SVN_INIT_CLIENT();
  ^~~~~~~~~~~~~~~~~~~

/tmp/ext-src/trunk/svn.c:1387:27: error: expected ')' before 'TSRMLS_CC'
   php_svn_handle_error(err TSRMLS_CC);
                           ^~~~~~~~~~
                           )

/tmp/ext-src/trunk/svn.c:1395:27: error: expected ')' before 'TSRMLS_CC'
   php_svn_handle_error(err TSRMLS_CC);
                           ^~~~~~~~~~
                           )

/tmp/ext-src/trunk/svn.c:1399:2: warning: 'svn_path_canonicalize' is deprecated [-Wdeprecated-declarations]
  can_path1= svn_path_canonicalize(utf8_path1, subpool);
  ^~~~~~~~~

In file included from /tmp/ext-src/trunk/svn.c:40:
/usr/include/subversion-1/svn_path.h:284:1: note: declared here
 svn_path_canonicalize(const char *path, apr_pool_t *pool);
 ^~~~~~~~~~~~~~~~~~~~~

/tmp/ext-src/trunk/svn.c:1400:2: warning: 'svn_path_canonicalize' is deprecated [-Wdeprecated-declarations]
  can_path2= svn_path_canonicalize(utf8_path2, subpool);
  ^~~~~~~~~

In file included from /tmp/ext-src/trunk/svn.c:40:
/usr/include/subversion-1/svn_path.h:284:1: note: declared here
 svn_path_canonicalize(const char *path, apr_pool_t *pool);
 ^~~~~~~~~~~~~~~~~~~~~

/tmp/ext-src/trunk/svn.c:1402:2: warning: 'svn_client_diff3' is deprecated [-Wdeprecated-declarations]
  err = svn_client_diff3(&diff_options,
  ^~~

In file included from /tmp/ext-src/trunk/php_svn.h:43,
                 from /tmp/ext-src/trunk/svn.c:33:
/usr/include/subversion-1/svn_client.h:3185:1: note: declared here
 svn_client_diff3(const apr_array_header_t *diff_options,
 ^~~~~~~~~~~~~~~~

/tmp/ext-src/trunk/svn.c:1416:27: error: expected ')' before 'TSRMLS_CC'
   php_svn_handle_error(err TSRMLS_CC);
                           ^~~~~~~~~~
                           )

/tmp/ext-src/trunk/svn.c: In function 'zif_svn_cleanup':

/tmp/ext-src/trunk/svn.c:1455:55: error: expected ')' before 'TSRMLS_CC'
  if (FAILURE == zend_parse_parameters(ZEND_NUM_ARGS() TSRMLS_CC, "s", &workingdir, &workingdir_len)) {
                                                       ^~~~~~~~~

/tmp/ext-src/trunk/svn.c:1455:17: error: too few arguments to function 'zend_parse_parameters'
  if (FAILURE == zend_parse_parameters(ZEND_NUM_ARGS() TSRMLS_CC, "s", &workingdir, &workingdir_len)) {
                 ^~~~~~~~~~~~~~~~~~~~~

In file included from /usr/local/include/php/main/php.h:35,
                 from /tmp/ext-src/trunk/svn.c:30:
/usr/local/include/php/Zend/zend_API.h:304:22: note: declared here
 ZEND_API zend_result zend_parse_parameters(uint32_t num_args, const char *type_spec, ...);
                      ^~~~~~~~~~~~~~~~~~~~~

/tmp/ext-src/trunk/svn.c:55:23: error: 'TSRMLS_C' undeclared (first use in this function); did you mean 'TSRM_H'?
   if (init_svn_client(TSRMLS_C)) RETURN_FALSE; \
                       ^~~~~~~~
/tmp/ext-src/trunk/svn.c:1459:2: note: in expansion of macro 'PHP_SVN_INIT_CLIENT'
  PHP_SVN_INIT_CLIENT();
  ^~~~~~~~~~~~~~~~~~~

/tmp/ext-src/trunk/svn.c:1467:27: error: expected ')' before 'TSRMLS_CC'
   php_svn_handle_error(err TSRMLS_CC);
                           ^~~~~~~~~~
                           )

/tmp/ext-src/trunk/svn.c:1472:2: warning: 'svn_path_canonicalize' is deprecated [-Wdeprecated-declarations]
  workingdir = svn_path_canonicalize(utf8_workingdir, subpool);
  ^~~~~~~~~~

In file included from /tmp/ext-src/trunk/svn.c:40:
/usr/include/subversion-1/svn_path.h:284:1: note: declared here
 svn_path_canonicalize(const char *path, apr_pool_t *pool);
 ^~~~~~~~~~~~~~~~~~~~~

/tmp/ext-src/trunk/svn.c:1474:2: warning: 'svn_client_cleanup' is deprecated [-Wdeprecated-declarations]
  err = svn_client_cleanup(workingdir, SVN_G(ctx), subpool);
  ^~~

In file included from /tmp/ext-src/trunk/php_svn.h:43,
                 from /tmp/ext-src/trunk/svn.c:33:
/usr/include/subversion-1/svn_client.h:4191:1: note: declared here
 svn_client_cleanup(const char *dir,
 ^~~~~~~~~~~~~~~~~~

/tmp/ext-src/trunk/svn.c:1477:27: error: expected ')' before 'TSRMLS_CC'
   php_svn_handle_error(err TSRMLS_CC);
                           ^~~~~~~~~~
                           )

/tmp/ext-src/trunk/svn.c: In function 'zif_svn_revert':

/tmp/ext-src/trunk/svn.c:1501:45: error: expected ')' before 'TSRMLS_CC'
  if( zend_parse_parameters( ZEND_NUM_ARGS() TSRMLS_CC, "s|b", &path, &pathlen, &recursive) ) {
                                             ^~~~~~~~~

/tmp/ext-src/trunk/svn.c:1501:6: error: too few arguments to function 'zend_parse_parameters'
  if( zend_parse_parameters( ZEND_NUM_ARGS() TSRMLS_CC, "s|b", &path, &pathlen, &recursive) ) {
      ^~~~~~~~~~~~~~~~~~~~~

In file included from /usr/local/include/php/main/php.h:35,
                 from /tmp/ext-src/trunk/svn.c:30:
/usr/local/include/php/Zend/zend_API.h:304:22: note: declared here
 ZEND_API zend_result zend_parse_parameters(uint32_t num_args, const char *type_spec, ...);
                      ^~~~~~~~~~~~~~~~~~~~~

/tmp/ext-src/trunk/svn.c:55:23: error: 'TSRMLS_C' undeclared (first use in this function); did you mean 'TSRM_H'?
   if (init_svn_client(TSRMLS_C)) RETURN_FALSE; \
                       ^~~~~~~~
/tmp/ext-src/trunk/svn.c:1505:2: note: in expansion of macro 'PHP_SVN_INIT_CLIENT'
  PHP_SVN_INIT_CLIENT();
  ^~~~~~~~~~~~~~~~~~~

/tmp/ext-src/trunk/svn.c:1513:27: error: expected ')' before 'TSRMLS_CC'
   php_svn_handle_error(err TSRMLS_CC);
                           ^~~~~~~~~~
                           )

/tmp/ext-src/trunk/svn.c:1520:2: warning: 'svn_path_canonicalize' is deprecated [-Wdeprecated-declarations]
  APR_ARRAY_PUSH(targets, const char *) = svn_path_canonicalize(utf8_path, subpool);
  ^~~~~~~~~~~~~~

In file included from /tmp/ext-src/trunk/svn.c:40:
/usr/include/subversion-1/svn_path.h:284:1: note: declared here
 svn_path_canonicalize(const char *path, apr_pool_t *pool);
 ^~~~~~~~~~~~~~~~~~~~~

/tmp/ext-src/trunk/svn.c:1522:2: warning: 'svn_client_revert' is deprecated [-Wdeprecated-declarations]
  err = svn_client_revert(
  ^~~

In file included from /tmp/ext-src/trunk/php_svn.h:43,
                 from /tmp/ext-src/trunk/svn.c:33:
/usr/include/subversion-1/svn_client.h:4350:1: note: declared here
 svn_client_revert(const apr_array_header_t *paths,
 ^~~~~~~~~~~~~~~~~

/tmp/ext-src/trunk/svn.c:1529:27: error: expected ')' before 'TSRMLS_CC'
   php_svn_handle_error(err TSRMLS_CC);
                           ^~~~~~~~~~
                           )

/tmp/ext-src/trunk/svn.c: In function 'zif_svn_resolved':

/tmp/ext-src/trunk/svn.c:1552:45: error: expected ')' before 'TSRMLS_CC'
  if( zend_parse_parameters( ZEND_NUM_ARGS() TSRMLS_CC, "s|b", &path, &pathlen, &recursive) ) {
                                             ^~~~~~~~~

/tmp/ext-src/trunk/svn.c:1552:6: error: too few arguments to function 'zend_parse_parameters'
  if( zend_parse_parameters( ZEND_NUM_ARGS() TSRMLS_CC, "s|b", &path, &pathlen, &recursive) ) {
      ^~~~~~~~~~~~~~~~~~~~~

In file included from /usr/local/include/php/main/php.h:35,
                 from /tmp/ext-src/trunk/svn.c:30:
/usr/local/include/php/Zend/zend_API.h:304:22: note: declared here
 ZEND_API zend_result zend_parse_parameters(uint32_t num_args, const char *type_spec, ...);
                      ^~~~~~~~~~~~~~~~~~~~~

/tmp/ext-src/trunk/svn.c:55:23: error: 'TSRMLS_C' undeclared (first use in this function); did you mean 'TSRM_H'?
   if (init_svn_client(TSRMLS_C)) RETURN_FALSE; \
                       ^~~~~~~~
/tmp/ext-src/trunk/svn.c:1556:2: note: in expansion of macro 'PHP_SVN_INIT_CLIENT'
  PHP_SVN_INIT_CLIENT();
  ^~~~~~~~~~~~~~~~~~~

/tmp/ext-src/trunk/svn.c:1565:27: error: expected ')' before 'TSRMLS_CC'
   php_svn_handle_error(err TSRMLS_CC);
                           ^~~~~~~~~~
                           )

/tmp/ext-src/trunk/svn.c:1570:2: warning: 'svn_path_canonicalize' is deprecated [-Wdeprecated-declarations]
  path = svn_path_canonicalize(utf8_path, subpool);
  ^~~~

In file included from /tmp/ext-src/trunk/svn.c:40:
/usr/include/subversion-1/svn_path.h:284:1: note: declared here
 svn_path_canonicalize(const char *path, apr_pool_t *pool);
 ^~~~~~~~~~~~~~~~~~~~~

/tmp/ext-src/trunk/svn.c:1572:2: warning: 'svn_client_resolved' is deprecated [-Wdeprecated-declarations]
  err = svn_client_resolved(
  ^~~

In file included from /tmp/ext-src/trunk/php_svn.h:43,
                 from /tmp/ext-src/trunk/svn.c:33:
/usr/include/subversion-1/svn_client.h:5128:1: note: declared here
 svn_client_resolved(const char *path,
 ^~~~~~~~~~~~~~~~~~~

/tmp/ext-src/trunk/svn.c:1579:27: error: expected ')' before 'TSRMLS_CC'
   php_svn_handle_error(err TSRMLS_CC);
                           ^~~~~~~~~~
                           )

/tmp/ext-src/trunk/svn.c: At top level:

/tmp/ext-src/trunk/svn.c:1592:39: error: expected ';', ',' or ')' before 'TSRMLS_DC'
 static int replicate_hash(zval *pDest TSRMLS_DC, int num_args, va_list args, zend_hash_key *key)
                                       ^~~~~~~~~

/tmp/ext-src/trunk/svn.c:1606:80: error: expected ';', ',' or ')' before 'TSRMLS_DC'
 static apr_hash_t *replicate_zend_hash_to_apr_hash(zval *arr, apr_pool_t *pool TSRMLS_DC)
                                                                                ^~~~~~~~~

/tmp/ext-src/trunk/svn.c: In function 'zif_svn_fs_revision_prop':

/tmp/ext-src/trunk/svn.c:1632:55: error: expected ')' before 'TSRMLS_CC'
  if (FAILURE == zend_parse_parameters(ZEND_NUM_ARGS() TSRMLS_CC, "rls",
                                                       ^~~~~~~~~

/tmp/ext-src/trunk/svn.c:1632:17: error: too few arguments to function 'zend_parse_parameters'
  if (FAILURE == zend_parse_parameters(ZEND_NUM_ARGS() TSRMLS_CC, "rls",
                 ^~~~~~~~~~~~~~~~~~~~~

In file included from /usr/local/include/php/main/php.h:35,
                 from /tmp/ext-src/trunk/svn.c:30:
/usr/local/include/php/Zend/zend_API.h:304:22: note: declared here
 ZEND_API zend_result zend_parse_parameters(uint32_t num_args, const char *type_spec, ...);
                      ^~~~~~~~~~~~~~~~~~~~~

/tmp/ext-src/trunk/svn.c:1644:2: warning: 'svn_fs_revision_prop' is deprecated [-Wdeprecated-declarations]
  err = svn_fs_revision_prop(&str, fs->fs, revnum, propname, subpool);
  ^~~

In file included from /tmp/ext-src/trunk/svn.c:41:
/usr/include/subversion-1/svn_fs.h:2816:1: note: declared here
 svn_fs_revision_prop(svn_string_t **value_p,
 ^~~~~~~~~~~~~~~~~~~~

/tmp/ext-src/trunk/svn.c:1646:27: error: expected ')' before 'TSRMLS_CC'
   php_svn_handle_error(err TSRMLS_CC);
                           ^~~~~~~~~~
                           )

/tmp/ext-src/trunk/svn.c: In function 'zif_svn_fs_youngest_rev':

/tmp/ext-src/trunk/svn.c:1668:55: error: expected ')' before 'TSRMLS_CC'
  if (FAILURE == zend_parse_parameters(ZEND_NUM_ARGS() TSRMLS_CC, "r",
                                                       ^~~~~~~~~

/tmp/ext-src/trunk/svn.c:1668:17: error: too few arguments to function 'zend_parse_parameters'
  if (FAILURE == zend_parse_parameters(ZEND_NUM_ARGS() TSRMLS_CC, "r",
                 ^~~~~~~~~~~~~~~~~~~~~

In file included from /usr/local/include/php/main/php.h:35,
                 from /tmp/ext-src/trunk/svn.c:30:
/usr/local/include/php/Zend/zend_API.h:304:22: note: declared here
 ZEND_API zend_result zend_parse_parameters(uint32_t num_args, const char *type_spec, ...);
                      ^~~~~~~~~~~~~~~~~~~~~

/tmp/ext-src/trunk/svn.c:1678:27: error: expected ')' before 'TSRMLS_CC'
   php_svn_handle_error(err TSRMLS_CC);
                           ^~~~~~~~~~
                           )

/tmp/ext-src/trunk/svn.c: In function 'zif_svn_fs_revision_root':

/tmp/ext-src/trunk/svn.c:1699:55: error: expected ')' before 'TSRMLS_CC'
  if (FAILURE == zend_parse_parameters(ZEND_NUM_ARGS() TSRMLS_CC, "rl",
                                                       ^~~~~~~~~

/tmp/ext-src/trunk/svn.c:1699:17: error: too few arguments to function 'zend_parse_parameters'
  if (FAILURE == zend_parse_parameters(ZEND_NUM_ARGS() TSRMLS_CC, "rl",
                 ^~~~~~~~~~~~~~~~~~~~~

In file included from /usr/local/include/php/main/php.h:35,
                 from /tmp/ext-src/trunk/svn.c:30:
/usr/local/include/php/Zend/zend_API.h:304:22: note: declared here
 ZEND_API zend_result zend_parse_parameters(uint32_t num_args, const char *type_spec, ...);
                      ^~~~~~~~~~~~~~~~~~~~~

/tmp/ext-src/trunk/svn.c:1708:27: error: expected ')' before 'TSRMLS_CC'
   php_svn_handle_error(err TSRMLS_CC);
                           ^~~~~~~~~~
                           )

/tmp/ext-src/trunk/svn.c: At top level:

/tmp/ext-src/trunk/svn.c:1721:86: error: expected ';', ',' or ')' before 'TSRMLS_DC'
 static size_t php_svn_stream_write(php_stream *stream, const char *buf, size_t count TSRMLS_DC)
                                                                                      ^~~~~~~~~

/tmp/ext-src/trunk/svn.c:1731:79: error: expected ';', ',' or ')' before 'TSRMLS_DC'
 static size_t php_svn_stream_read(php_stream *stream, char *buf, size_t count TSRMLS_DC)
                                                                               ^~~~~~~~~

/tmp/ext-src/trunk/svn.c:1743:70: error: expected ';', ',' or ')' before 'TSRMLS_DC'
 static int php_svn_stream_close(php_stream *stream, int close_handle TSRMLS_DC)
                                                                      ^~~~~~~~~

/tmp/ext-src/trunk/svn.c:1751:52: error: expected ';', ',' or ')' before 'TSRMLS_DC'
 static int php_svn_stream_flush(php_stream *stream TSRMLS_DC)
                                                    ^~~~~~~~~

/tmp/ext-src/trunk/svn.c:1757:2: error: 'php_svn_stream_write' undeclared here (not in a function); did you mean 'svn_stream_write'?
  php_svn_stream_write,
  ^~~~~~~~~~~~~~~~~~~~
  svn_stream_write

/tmp/ext-src/trunk/svn.c:1758:2: error: 'php_svn_stream_read' undeclared here (not in a function); did you mean 'php_svn_stream_ops'?
  php_svn_stream_read,
  ^~~~~~~~~~~~~~~~~~~
  php_svn_stream_ops

/tmp/ext-src/trunk/svn.c:1759:2: error: 'php_svn_stream_close' undeclared here (not in a function); did you mean 'php_svn_stream_ops'?
  php_svn_stream_close,
  ^~~~~~~~~~~~~~~~~~~~
  php_svn_stream_ops

/tmp/ext-src/trunk/svn.c:1760:2: error: 'php_svn_stream_flush' undeclared here (not in a function); did you mean 'php_svn_stream_ops'?
  php_svn_stream_flush,
  ^~~~~~~~~~~~~~~~~~~~
  php_svn_stream_ops

/tmp/ext-src/trunk/svn.c: In function 'zif_svn_fs_file_contents':

/tmp/ext-src/trunk/svn.c:1781:55: error: expected ')' before 'TSRMLS_CC'
  if (FAILURE == zend_parse_parameters(ZEND_NUM_ARGS() TSRMLS_CC, "rs",
                                                       ^~~~~~~~~

/tmp/ext-src/trunk/svn.c:1781:17: error: too few arguments to function 'zend_parse_parameters'
  if (FAILURE == zend_parse_parameters(ZEND_NUM_ARGS() TSRMLS_CC, "rs",
                 ^~~~~~~~~~~~~~~~~~~~~

In file included from /usr/local/include/php/main/php.h:35,
                 from /tmp/ext-src/trunk/svn.c:30:
/usr/local/include/php/Zend/zend_API.h:304:22: note: declared here
 ZEND_API zend_result zend_parse_parameters(uint32_t num_args, const char *type_spec, ...);
                      ^~~~~~~~~~~~~~~~~~~~~

/tmp/ext-src/trunk/svn.c:1795:27: error: expected ')' before 'TSRMLS_CC'
   php_svn_handle_error(err TSRMLS_CC);
                           ^~~~~~~~~~
                           )

/tmp/ext-src/trunk/svn.c:1800:2: warning: 'svn_path_canonicalize' is deprecated [-Wdeprecated-declarations]
  path = svn_path_canonicalize(utf8_path, subpool);
  ^~~~

In file included from /tmp/ext-src/trunk/svn.c:40:
/usr/include/subversion-1/svn_path.h:284:1: note: declared here
 svn_path_canonicalize(const char *path, apr_pool_t *pool);
 ^~~~~~~~~~~~~~~~~~~~~

/tmp/ext-src/trunk/svn.c:1805:27: error: expected ')' before 'TSRMLS_CC'
   php_svn_handle_error(err TSRMLS_CC);
                           ^~~~~~~~~~
                           )

/tmp/ext-src/trunk/svn.c: In function 'zif_svn_fs_file_length':

/tmp/ext-src/trunk/svn.c:1831:55: error: expected ')' before 'TSRMLS_CC'
  if (FAILURE == zend_parse_parameters(ZEND_NUM_ARGS() TSRMLS_CC, "rs",
                                                       ^~~~~~~~~

/tmp/ext-src/trunk/svn.c:1831:17: error: too few arguments to function 'zend_parse_parameters'
  if (FAILURE == zend_parse_parameters(ZEND_NUM_ARGS() TSRMLS_CC, "rs",
                 ^~~~~~~~~~~~~~~~~~~~~

In file included from /usr/local/include/php/main/php.h:35,
                 from /tmp/ext-src/trunk/svn.c:30:
/usr/local/include/php/Zend/zend_API.h:304:22: note: declared here
 ZEND_API zend_result zend_parse_parameters(uint32_t num_args, const char *type_spec, ...);
                      ^~~~~~~~~~~~~~~~~~~~~

/tmp/ext-src/trunk/svn.c:1845:27: error: expected ')' before 'TSRMLS_CC'
   php_svn_handle_error(err TSRMLS_CC);
                           ^~~~~~~~~~
                           )

/tmp/ext-src/trunk/svn.c:1850:2: warning: 'svn_path_canonicalize' is deprecated [-Wdeprecated-declarations]
  path = svn_path_canonicalize(utf8_path, subpool);
  ^~~~

In file included from /tmp/ext-src/trunk/svn.c:40:
/usr/include/subversion-1/svn_path.h:284:1: note: declared here
 svn_path_canonicalize(const char *path, apr_pool_t *pool);
 ^~~~~~~~~~~~~~~~~~~~~

/tmp/ext-src/trunk/svn.c:1855:27: error: expected ')' before 'TSRMLS_CC'
   php_svn_handle_error(err TSRMLS_CC);
                           ^~~~~~~~~~
                           )

/tmp/ext-src/trunk/svn.c: In function 'zif_svn_fs_node_prop':

/tmp/ext-src/trunk/svn.c:1881:55: error: expected ')' before 'TSRMLS_CC'
  if (FAILURE == zend_parse_parameters(ZEND_NUM_ARGS() TSRMLS_CC, "rss",
                                                       ^~~~~~~~~

/tmp/ext-src/trunk/svn.c:1881:17: error: too few arguments to function 'zend_parse_parameters'
  if (FAILURE == zend_parse_parameters(ZEND_NUM_ARGS() TSRMLS_CC, "rss",
                 ^~~~~~~~~~~~~~~~~~~~~

In file included from /usr/local/include/php/main/php.h:35,
                 from /tmp/ext-src/trunk/svn.c:30:
/usr/local/include/php/Zend/zend_API.h:304:22: note: declared here
 ZEND_API zend_result zend_parse_parameters(uint32_t num_args, const char *type_spec, ...);
                      ^~~~~~~~~~~~~~~~~~~~~

/tmp/ext-src/trunk/svn.c:1895:27: error: expected ')' before 'TSRMLS_CC'
   php_svn_handle_error(err TSRMLS_CC);
                           ^~~~~~~~~~
                           )

/tmp/ext-src/trunk/svn.c:1900:2: warning: 'svn_path_canonicalize' is deprecated [-Wdeprecated-declarations]
  path = svn_path_canonicalize(utf8_path, subpool);
  ^~~~

In file included from /tmp/ext-src/trunk/svn.c:40:
/usr/include/subversion-1/svn_path.h:284:1: note: declared here
 svn_path_canonicalize(const char *path, apr_pool_t *pool);
 ^~~~~~~~~~~~~~~~~~~~~

/tmp/ext-src/trunk/svn.c:1905:27: error: expected ')' before 'TSRMLS_CC'
   php_svn_handle_error(err TSRMLS_CC);
                           ^~~~~~~~~~
                           )

/tmp/ext-src/trunk/svn.c: In function 'zif_svn_fs_node_created_rev':

/tmp/ext-src/trunk/svn.c:1934:55: error: expected ')' before 'TSRMLS_CC'
  if (FAILURE == zend_parse_parameters(ZEND_NUM_ARGS() TSRMLS_CC, "rs",
                                                       ^~~~~~~~~

/tmp/ext-src/trunk/svn.c:1934:17: error: too few arguments to function 'zend_parse_parameters'
  if (FAILURE == zend_parse_parameters(ZEND_NUM_ARGS() TSRMLS_CC, "rs",
                 ^~~~~~~~~~~~~~~~~~~~~

In file included from /usr/local/include/php/main/php.h:35,
                 from /tmp/ext-src/trunk/svn.c:30:
/usr/local/include/php/Zend/zend_API.h:304:22: note: declared here
 ZEND_API zend_result zend_parse_parameters(uint32_t num_args, const char *type_spec, ...);
                      ^~~~~~~~~~~~~~~~~~~~~

/tmp/ext-src/trunk/svn.c:1948:27: error: expected ')' before 'TSRMLS_CC'
   php_svn_handle_error(err TSRMLS_CC);
                           ^~~~~~~~~~
                           )

/tmp/ext-src/trunk/svn.c:1953:2: warning: 'svn_path_canonicalize' is deprecated [-Wdeprecated-declarations]
  path = svn_path_canonicalize(utf8_path, subpool);
  ^~~~

In file included from /tmp/ext-src/trunk/svn.c:40:
/usr/include/subversion-1/svn_path.h:284:1: note: declared here
 svn_path_canonicalize(const char *path, apr_pool_t *pool);
 ^~~~~~~~~~~~~~~~~~~~~

/tmp/ext-src/trunk/svn.c:1958:27: error: expected ')' before 'TSRMLS_CC'
   php_svn_handle_error(err TSRMLS_CC);
                           ^~~~~~~~~~
                           )

/tmp/ext-src/trunk/svn.c: In function 'zif_svn_fs_dir_entries':

/tmp/ext-src/trunk/svn.c:1987:55: error: expected ')' before 'TSRMLS_CC'
  if (FAILURE == zend_parse_parameters(ZEND_NUM_ARGS() TSRMLS_CC, "rs",
                                                       ^~~~~~~~~

/tmp/ext-src/trunk/svn.c:1987:17: error: too few arguments to function 'zend_parse_parameters'
  if (FAILURE == zend_parse_parameters(ZEND_NUM_ARGS() TSRMLS_CC, "rs",
                 ^~~~~~~~~~~~~~~~~~~~~

In file included from /usr/local/include/php/main/php.h:35,
                 from /tmp/ext-src/trunk/svn.c:30:
/usr/local/include/php/Zend/zend_API.h:304:22: note: declared here
 ZEND_API zend_result zend_parse_parameters(uint32_t num_args, const char *type_spec, ...);
                      ^~~~~~~~~~~~~~~~~~~~~

/tmp/ext-src/trunk/svn.c:2001:27: error: expected ')' before 'TSRMLS_CC'
   php_svn_handle_error(err TSRMLS_CC);
                           ^~~~~~~~~~
                           )

/tmp/ext-src/trunk/svn.c:2006:2: warning: 'svn_path_canonicalize' is deprecated [-Wdeprecated-declarations]
  path = svn_path_canonicalize(utf8_path, subpool);
  ^~~~

In file included from /tmp/ext-src/trunk/svn.c:40:
/usr/include/subversion-1/svn_path.h:284:1: note: declared here
 svn_path_canonicalize(const char *path, apr_pool_t *pool);
 ^~~~~~~~~~~~~~~~~~~~~

/tmp/ext-src/trunk/svn.c:2011:27: error: expected ')' before 'TSRMLS_CC'
   php_svn_handle_error(err TSRMLS_CC);
                           ^~~~~~~~~~
                           )

/tmp/ext-src/trunk/svn.c: In function 'zif_svn_fs_check_path':

/tmp/ext-src/trunk/svn.c:2040:55: error: expected ')' before 'TSRMLS_CC'
  if (FAILURE == zend_parse_parameters(ZEND_NUM_ARGS() TSRMLS_CC, "rs",
                                                       ^~~~~~~~~

/tmp/ext-src/trunk/svn.c:2040:17: error: too few arguments to function 'zend_parse_parameters'
  if (FAILURE == zend_parse_parameters(ZEND_NUM_ARGS() TSRMLS_CC, "rs",
                 ^~~~~~~~~~~~~~~~~~~~~
In file included from /usr/local/include/php/main/php.h:35,
                 from /tmp/ext-src/trunk/svn.c:30:
/usr/local/include/php/Zend/zend_API.h:304:22: note: declared here
 ZEND_API zend_result zend_parse_parameters(uint32_t num_args, const char *type_spec, ...);
                      ^~~~~~~~~~~~~~~~~~~~~

/tmp/ext-src/trunk/svn.c:2054:27: error: expected ')' before 'TSRMLS_CC'
   php_svn_handle_error(err TSRMLS_CC);
                           ^~~~~~~~~~
                           )

/tmp/ext-src/trunk/svn.c:2059:2: warning: 'svn_path_canonicalize' is deprecated [-Wdeprecated-declarations]
  path = svn_path_canonicalize(utf8_path, subpool);
  ^~~~

In file included from /tmp/ext-src/trunk/svn.c:40:
/usr/include/subversion-1/svn_path.h:284:1: note: declared here
 svn_path_canonicalize(const char *path, apr_pool_t *pool);
 ^~~~~~~~~~~~~~~~~~~~~

/tmp/ext-src/trunk/svn.c:2064:27: error: expected ')' before 'TSRMLS_CC'
   php_svn_handle_error(err TSRMLS_CC);
                           ^~~~~~~~~~
                           )

/tmp/ext-src/trunk/svn.c: In function 'zif_svn_repos_fs':

/tmp/ext-src/trunk/svn.c:2084:55: error: expected ')' before 'TSRMLS_CC'
  if (FAILURE == zend_parse_parameters(ZEND_NUM_ARGS() TSRMLS_CC, "r",
                                                       ^~~~~~~~~

/tmp/ext-src/trunk/svn.c:2084:17: error: too few arguments to function 'zend_parse_parameters'
  if (FAILURE == zend_parse_parameters(ZEND_NUM_ARGS() TSRMLS_CC, "r",
                 ^~~~~~~~~~~~~~~~~~~~~

In file included from /usr/local/include/php/main/php.h:35,
                 from /tmp/ext-src/trunk/svn.c:30:
/usr/local/include/php/Zend/zend_API.h:304:22: note: declared here
 ZEND_API zend_result zend_parse_parameters(uint32_t num_args, const char *type_spec, ...);
                      ^~~~~~~~~~~~~~~~~~~~~

/tmp/ext-src/trunk/svn.c: In function 'zif_svn_repos_open':

/tmp/ext-src/trunk/svn.c:2113:55: error: expected ')' before 'TSRMLS_CC'
  if (FAILURE == zend_parse_parameters(ZEND_NUM_ARGS() TSRMLS_CC, "s",
                                                       ^~~~~~~~~

/tmp/ext-src/trunk/svn.c:2113:17: error: too few arguments to function 'zend_parse_parameters'
  if (FAILURE == zend_parse_parameters(ZEND_NUM_ARGS() TSRMLS_CC, "s",
                 ^~~~~~~~~~~~~~~~~~~~~

In file included from /usr/local/include/php/main/php.h:35,
                 from /tmp/ext-src/trunk/svn.c:30:
/usr/local/include/php/Zend/zend_API.h:304:22: note: declared here
 ZEND_API zend_result zend_parse_parameters(uint32_t num_args, const char *type_spec, ...);
                      ^~~~~~~~~~~~~~~~~~~~~

/tmp/ext-src/trunk/svn.c:55:23: error: 'TSRMLS_C' undeclared (first use in this function); did you mean 'TSRM_H'?
   if (init_svn_client(TSRMLS_C)) RETURN_FALSE; \
                       ^~~~~~~~
/tmp/ext-src/trunk/svn.c:2118:2: note: in expansion of macro 'PHP_SVN_INIT_CLIENT'
  PHP_SVN_INIT_CLIENT();
  ^~~~~~~~~~~~~~~~~~~

/tmp/ext-src/trunk/svn.c:2126:27: error: expected ')' before 'TSRMLS_CC'
   php_svn_handle_error(err TSRMLS_CC);
                           ^~~~~~~~~~
                           )

/tmp/ext-src/trunk/svn.c:2131:2: warning: 'svn_path_canonicalize' is deprecated [-Wdeprecated-declarations]
  path = svn_path_canonicalize(utf8_path, subpool);
  ^~~~

In file included from /tmp/ext-src/trunk/svn.c:40:
/usr/include/subversion-1/svn_path.h:284:1: note: declared here
 svn_path_canonicalize(const char *path, apr_pool_t *pool);
 ^~~~~~~~~~~~~~~~~~~~~

/tmp/ext-src/trunk/svn.c:2133:2: warning: 'svn_repos_open' is deprecated [-Wdeprecated-declarations]
  err = svn_repos_open(&repos, path, subpool);
  ^~~

In file included from /tmp/ext-src/trunk/svn.c:42:
/usr/include/subversion-1/svn_repos.h:464:1: note: declared here
 svn_repos_open(svn_repos_t **repos_p,
 ^~~~~~~~~~~~~~

/tmp/ext-src/trunk/svn.c:2136:27: error: expected ')' before 'TSRMLS_CC'
   php_svn_handle_error(err TSRMLS_CC);
                           ^~~~~~~~~~
                           )

/tmp/ext-src/trunk/svn.c: In function 'zif_svn_info':

/tmp/ext-src/trunk/svn.c:2206:55: error: expected ')' before 'TSRMLS_CC'
  if (FAILURE == zend_parse_parameters(ZEND_NUM_ARGS() TSRMLS_CC, "s|bl",
                                                       ^~~~~~~~~

/tmp/ext-src/trunk/svn.c:2206:17: error: too few arguments to function 'zend_parse_parameters'
  if (FAILURE == zend_parse_parameters(ZEND_NUM_ARGS() TSRMLS_CC, "s|bl",
                 ^~~~~~~~~~~~~~~~~~~~~

In file included from /usr/local/include/php/main/php.h:35,
                 from /tmp/ext-src/trunk/svn.c:30:
/usr/local/include/php/Zend/zend_API.h:304:22: note: declared here
 ZEND_API zend_result zend_parse_parameters(uint32_t num_args, const char *type_spec, ...);
                      ^~~~~~~~~~~~~~~~~~~~~

/tmp/ext-src/trunk/svn.c:55:23: error: 'TSRMLS_C' undeclared (first use in this function); did you mean 'TSRM_H'?
   if (init_svn_client(TSRMLS_C)) RETURN_FALSE; \
                       ^~~~~~~~
/tmp/ext-src/trunk/svn.c:2211:2: note: in expansion of macro 'PHP_SVN_INIT_CLIENT'
  PHP_SVN_INIT_CLIENT();
  ^~~~~~~~~~~~~~~~~~~

/tmp/ext-src/trunk/svn.c:2220:27: error: expected ')' before 'TSRMLS_CC'
   php_svn_handle_error(err TSRMLS_CC);
                           ^~~~~~~~~~
                           )

/tmp/ext-src/trunk/svn.c:2225:2: warning: 'svn_path_canonicalize' is deprecated [-Wdeprecated-declarations]
  path = svn_path_canonicalize(utf8_path, subpool);
  ^~~~

In file included from /tmp/ext-src/trunk/svn.c:40:
/usr/include/subversion-1/svn_path.h:284:1: note: declared here
 svn_path_canonicalize(const char *path, apr_pool_t *pool);
 ^~~~~~~~~~~~~~~~~~~~~

/tmp/ext-src/trunk/svn.c:2235:28: error: expected ')' before 'TSRMLS_CC'
    php_svn_handle_error(err TSRMLS_CC);
                            ^~~~~~~~~~
                            )

/tmp/ext-src/trunk/svn.c:2246:2: warning: 'svn_client_info' is deprecated [-Wdeprecated-declarations]
  err = svn_client_info(true_path, &peg_revision, &revision, info_func, return_value, recurse, SVN_G(ctx), subpool);
  ^~~

In file included from /tmp/ext-src/trunk/php_svn.h:43,
                 from /tmp/ext-src/trunk/svn.c:33:
/usr/include/subversion-1/svn_client.h:7381:1: note: declared here
 svn_client_info(const char *path_or_url,
 ^~~~~~~~~~~~~~~

/tmp/ext-src/trunk/svn.c:2248:27: error: expected ')' before 'TSRMLS_CC'
   php_svn_handle_error(err TSRMLS_CC);
                           ^~~~~~~~~~
                           )

/tmp/ext-src/trunk/svn.c: In function 'zif_svn_export':

/tmp/ext-src/trunk/svn.c:2273:55: error: expected ')' before 'TSRMLS_CC'
  if (FAILURE == zend_parse_parameters(ZEND_NUM_ARGS() TSRMLS_CC, "ss|bl",
                                                       ^~~~~~~~~

/tmp/ext-src/trunk/svn.c:2273:17: error: too few arguments to function 'zend_parse_parameters'
  if (FAILURE == zend_parse_parameters(ZEND_NUM_ARGS() TSRMLS_CC, "ss|bl",
                 ^~~~~~~~~~~~~~~~~~~~~

In file included from /usr/local/include/php/main/php.h:35,
                 from /tmp/ext-src/trunk/svn.c:30:
/usr/local/include/php/Zend/zend_API.h:304:22: note: declared here
 ZEND_API zend_result zend_parse_parameters(uint32_t num_args, const char *type_spec, ...);
                      ^~~~~~~~~~~~~~~~~~~~~

/tmp/ext-src/trunk/svn.c:55:23: error: 'TSRMLS_C' undeclared (first use in this function); did you mean 'TSRM_H'?
   if (init_svn_client(TSRMLS_C)) RETURN_FALSE; \
                       ^~~~~~~~
/tmp/ext-src/trunk/svn.c:2278:2: note: in expansion of macro 'PHP_SVN_INIT_CLIENT'
  PHP_SVN_INIT_CLIENT();
  ^~~~~~~~~~~~~~~~~~~

/tmp/ext-src/trunk/svn.c:2287:27: error: expected ')' before 'TSRMLS_CC'
   php_svn_handle_error(err TSRMLS_CC);
                           ^~~~~~~~~~
                           )

/tmp/ext-src/trunk/svn.c:2294:27: error: expected ')' before 'TSRMLS_CC'
   php_svn_handle_error(err TSRMLS_CC);
                           ^~~~~~~~~~
                           )

/tmp/ext-src/trunk/svn.c:2299:2: warning: 'svn_path_canonicalize' is deprecated [-Wdeprecated-declarations]
  from = svn_path_canonicalize(utf8_from_path, subpool);
  ^~~~

In file included from /tmp/ext-src/trunk/svn.c:40:
/usr/include/subversion-1/svn_path.h:284:1: note: declared here
 svn_path_canonicalize(const char *path, apr_pool_t *pool);
 ^~~~~~~~~~~~~~~~~~~~~

/tmp/ext-src/trunk/svn.c:2300:2: warning: 'svn_path_canonicalize' is deprecated [-Wdeprecated-declarations]
  to = svn_path_canonicalize(utf8_to_path, subpool);
  ^~

In file included from /tmp/ext-src/trunk/svn.c:40:
/usr/include/subversion-1/svn_path.h:284:1: note: declared here
 svn_path_canonicalize(const char *path, apr_pool_t *pool);
 ^~~~~~~~~~~~~~~~~~~~~

/tmp/ext-src/trunk/svn.c:2311:2: warning: 'svn_client_export3' is deprecated [-Wdeprecated-declarations]
  err = svn_client_export3(NULL, from, to, &peg_revision, &revision, TRUE, FALSE, TRUE, NULL, SVN_G(ctx), subpool);
  ^~~

In file included from /tmp/ext-src/trunk/php_svn.h:43,
                 from /tmp/ext-src/trunk/svn.c:33:
/usr/include/subversion-1/svn_client.h:6338:1: note: declared here
 svn_client_export3(svn_revnum_t *result_rev,
 ^~~~~~~~~~~~~~~~~~

/tmp/ext-src/trunk/svn.c:2314:27: error: expected ')' before 'TSRMLS_CC'
   php_svn_handle_error(err TSRMLS_CC);
                           ^~~~~~~~~~
                           )

/tmp/ext-src/trunk/svn.c: In function 'zif_svn_switch':

/tmp/ext-src/trunk/svn.c:2338:55: error: expected ')' before 'TSRMLS_CC'
  if (FAILURE == zend_parse_parameters(ZEND_NUM_ARGS() TSRMLS_CC, "ss|b",
                                                       ^~~~~~~~~

/tmp/ext-src/trunk/svn.c:2338:17: error: too few arguments to function 'zend_parse_parameters'
  if (FAILURE == zend_parse_parameters(ZEND_NUM_ARGS() TSRMLS_CC, "ss|b",
                 ^~~~~~~~~~~~~~~~~~~~~

In file included from /usr/local/include/php/main/php.h:35,
                 from /tmp/ext-src/trunk/svn.c:30:
/usr/local/include/php/Zend/zend_API.h:304:22: note: declared here
 ZEND_API zend_result zend_parse_parameters(uint32_t num_args, const char *type_spec, ...);
                      ^~~~~~~~~~~~~~~~~~~~~

/tmp/ext-src/trunk/svn.c:55:23: error: 'TSRMLS_C' undeclared (first use in this function); did you mean 'TSRM_H'?
   if (init_svn_client(TSRMLS_C)) RETURN_FALSE; \
                       ^~~~~~~~
/tmp/ext-src/trunk/svn.c:2343:2: note: in expansion of macro 'PHP_SVN_INIT_CLIENT'
  PHP_SVN_INIT_CLIENT();
  ^~~~~~~~~~~~~~~~~~~

/tmp/ext-src/trunk/svn.c:2352:27: error: expected ')' before 'TSRMLS_CC'
   php_svn_handle_error(err TSRMLS_CC);
                           ^~~~~~~~~~
                           )

/tmp/ext-src/trunk/svn.c:2358:27: error: expected ')' before 'TSRMLS_CC'
   php_svn_handle_error(err TSRMLS_CC);
                           ^~~~~~~~~~
                           )

/tmp/ext-src/trunk/svn.c:2363:2: warning: 'svn_path_canonicalize' is deprecated [-Wdeprecated-declarations]
  path = svn_path_canonicalize(utf8_path, subpool);
  ^~~~

In file included from /tmp/ext-src/trunk/svn.c:40:
/usr/include/subversion-1/svn_path.h:284:1: note: declared here
 svn_path_canonicalize(const char *path, apr_pool_t *pool);
 ^~~~~~~~~~~~~~~~~~~~~

/tmp/ext-src/trunk/svn.c:2364:2: warning: 'svn_path_canonicalize' is deprecated [-Wdeprecated-declarations]
  url = svn_path_canonicalize(utf8_url, subpool);
  ^~~

In file included from /tmp/ext-src/trunk/svn.c:40:
/usr/include/subversion-1/svn_path.h:284:1: note: declared here
 svn_path_canonicalize(const char *path, apr_pool_t *pool);
 ^~~~~~~~~~~~~~~~~~~~~

/tmp/ext-src/trunk/svn.c:2372:2: warning: 'svn_client_switch' is deprecated [-Wdeprecated-declarations]
  err = svn_client_switch(NULL, path, url, &revision, TRUE, SVN_G(ctx), subpool);
  ^~~

In file included from /tmp/ext-src/trunk/php_svn.h:43,
                 from /tmp/ext-src/trunk/svn.c:33:
/usr/include/subversion-1/svn_client.h:1540:1: note: declared here
 svn_client_switch(svn_revnum_t *result_rev,
 ^~~~~~~~~~~~~~~~~

/tmp/ext-src/trunk/svn.c:2375:27: error: expected ')' before 'TSRMLS_CC'
   php_svn_handle_error(err TSRMLS_CC);
                           ^~~~~~~~~~
                           )

/tmp/ext-src/trunk/svn.c: In function 'zif_svn_copy':

/tmp/ext-src/trunk/svn.c:2402:55: error: expected ')' before 'TSRMLS_CC'
  if (FAILURE == zend_parse_parameters(ZEND_NUM_ARGS() TSRMLS_CC, "sss|bl",
                                                       ^~~~~~~~~

/tmp/ext-src/trunk/svn.c:2402:17: error: too few arguments to function 'zend_parse_parameters'
  if (FAILURE == zend_parse_parameters(ZEND_NUM_ARGS() TSRMLS_CC, "sss|bl",
                 ^~~~~~~~~~~~~~~~~~~~~

In file included from /usr/local/include/php/main/php.h:35,
                 from /tmp/ext-src/trunk/svn.c:30:
/usr/local/include/php/Zend/zend_API.h:304:22: note: declared here
 ZEND_API zend_result zend_parse_parameters(uint32_t num_args, const char *type_spec, ...);
                      ^~~~~~~~~~~~~~~~~~~~~

/tmp/ext-src/trunk/svn.c:55:23: error: 'TSRMLS_C' undeclared (first use in this function); did you mean 'TSRM_H'?
   if (init_svn_client(TSRMLS_C)) RETURN_FALSE; \
                       ^~~~~~~~
/tmp/ext-src/trunk/svn.c:2408:2: note: in expansion of macro 'PHP_SVN_INIT_CLIENT'
  PHP_SVN_INIT_CLIENT();
  ^~~~~~~~~~~~~~~~~~~

/tmp/ext-src/trunk/svn.c:2417:27: error: expected ')' before 'TSRMLS_CC'
   php_svn_handle_error(err TSRMLS_CC);
                           ^~~~~~~~~~
                           )

/tmp/ext-src/trunk/svn.c:2423:27: error: expected ')' before 'TSRMLS_CC'
   php_svn_handle_error(err TSRMLS_CC);
                           ^~~~~~~~~~
                           )

/tmp/ext-src/trunk/svn.c:2428:2: warning: 'svn_path_canonicalize' is deprecated [-Wdeprecated-declarations]
  src_path = svn_path_canonicalize(utf8_src_path, subpool);
  ^~~~~~~~

In file included from /tmp/ext-src/trunk/svn.c:40:
/usr/include/subversion-1/svn_path.h:284:1: note: declared here
 svn_path_canonicalize(const char *path, apr_pool_t *pool);
 ^~~~~~~~~~~~~~~~~~~~~

/tmp/ext-src/trunk/svn.c:2429:2: warning: 'svn_path_canonicalize' is deprecated [-Wdeprecated-declarations]
  dst_path = svn_path_canonicalize(utf8_dst_path, subpool);
  ^~~~~~~~

In file included from /tmp/ext-src/trunk/svn.c:40:
/usr/include/subversion-1/svn_path.h:284:1: note: declared here
 svn_path_canonicalize(const char *path, apr_pool_t *pool);
 ^~~~~~~~~~~~~~~~~~~~~

/tmp/ext-src/trunk/svn.c:2441:2: warning: 'svn_client_copy2' is deprecated [-Wdeprecated-declarations]
  err = svn_client_copy2(&info, src_path, &revision, dst_path, SVN_G(ctx), subpool);
  ^~~

In file included from /tmp/ext-src/trunk/php_svn.h:43,
                 from /tmp/ext-src/trunk/svn.c:33:
/usr/include/subversion-1/svn_client.h:5419:1: note: declared here
 svn_client_copy2(svn_commit_info_t **commit_info_p,
 ^~~~~~~~~~~~~~~~

/tmp/ext-src/trunk/svn.c:2445:27: error: expected ')' before 'TSRMLS_CC'
   php_svn_handle_error(err TSRMLS_CC);
                           ^~~~~~~~~~
                           )

/tmp/ext-src/trunk/svn.c:2462:25: error: expected ')' before 'TSRMLS_CC'
   php_error_docref(NULL TSRMLS_CC, E_WARNING, "commit didn't return any info");
                         ^~~~~~~~~

/tmp/ext-src/trunk/svn.c:2462:3: error: too few arguments to function 'php_error_docref'
   php_error_docref(NULL TSRMLS_CC, E_WARNING, "commit didn't return any info");
   ^~~~~~~~~~~~~~~~

In file included from /tmp/ext-src/trunk/svn.c:30:
/usr/local/include/php/main/php.h:341:23: note: declared here
 PHPAPI ZEND_COLD void php_error_docref(const char *docref, int type, const char *format, ...)
                       ^~~~~~~~~~~~~~~~

/tmp/ext-src/trunk/svn.c: In function 'zif_svn_blame':

/tmp/ext-src/trunk/svn.c:2526:44: error: expected ')' before 'TSRMLS_CC'
  if (zend_parse_parameters(ZEND_NUM_ARGS() TSRMLS_CC, "s|l", &repos_url, &repos_url_len, &revision) == FAILURE) {
                                            ^~~~~~~~~

/tmp/ext-src/trunk/svn.c:2526:6: error: too few arguments to function 'zend_parse_parameters'
  if (zend_parse_parameters(ZEND_NUM_ARGS() TSRMLS_CC, "s|l", &repos_url, &repos_url_len, &revision) == FAILURE) {
      ^~~~~~~~~~~~~~~~~~~~~

In file included from /usr/local/include/php/main/php.h:35,
                 from /tmp/ext-src/trunk/svn.c:30:
/usr/local/include/php/Zend/zend_API.h:304:22: note: declared here
 ZEND_API zend_result zend_parse_parameters(uint32_t num_args, const char *type_spec, ...);
                      ^~~~~~~~~~~~~~~~~~~~~

/tmp/ext-src/trunk/svn.c:55:23: error: 'TSRMLS_C' undeclared (first use in this function); did you mean 'TSRM_H'?
   if (init_svn_client(TSRMLS_C)) RETURN_FALSE; \
                       ^~~~~~~~
/tmp/ext-src/trunk/svn.c:2530:2: note: in expansion of macro 'PHP_SVN_INIT_CLIENT'
  PHP_SVN_INIT_CLIENT();
  ^~~~~~~~~~~~~~~~~~~

/tmp/ext-src/trunk/svn.c:2538:27: error: expected ')' before 'TSRMLS_CC'
   php_svn_handle_error(err TSRMLS_CC);
                           ^~~~~~~~~~
                           )

/tmp/ext-src/trunk/svn.c:2543:2: warning: 'svn_path_canonicalize' is deprecated [-Wdeprecated-declarations]
  repos_url = svn_path_canonicalize(utf8_repos_url, subpool);
  ^~~~~~~~~

In file included from /tmp/ext-src/trunk/svn.c:40:
/usr/include/subversion-1/svn_path.h:284:1: note: declared here
 svn_path_canonicalize(const char *path, apr_pool_t *pool);
 ^~~~~~~~~~~~~~~~~~~~~

/tmp/ext-src/trunk/svn.c:2557:27: error: expected ')' before 'TSRMLS_CC'
   php_svn_handle_error(err TSRMLS_CC);
                           ^~~~~~~~~~
                           )

/tmp/ext-src/trunk/svn.c:2564:2: warning: 'svn_client_blame2' is deprecated [-Wdeprecated-declarations]
  err = svn_client_blame2(
  ^~~

In file included from /tmp/ext-src/trunk/php_svn.h:43,
                 from /tmp/ext-src/trunk/svn.c:33:
/usr/include/subversion-1/svn_client.h:2969:1: note: declared here
 svn_client_blame2(const char *path_or_url,
 ^~~~~~~~~~~~~~~~~

/tmp/ext-src/trunk/svn.c:2575:27: error: expected ')' before 'TSRMLS_CC'
   php_svn_handle_error(err TSRMLS_CC);
                           ^~~~~~~~~~
                           )

/tmp/ext-src/trunk/svn.c: In function 'zif_svn_delete':

/tmp/ext-src/trunk/svn.c:2598:55: error: expected ')' before 'TSRMLS_CC'
  if (FAILURE == zend_parse_parameters(ZEND_NUM_ARGS() TSRMLS_CC, "s|bs",
                                                       ^~~~~~~~~

/tmp/ext-src/trunk/svn.c:2598:17: error: too few arguments to function 'zend_parse_parameters'
  if (FAILURE == zend_parse_parameters(ZEND_NUM_ARGS() TSRMLS_CC, "s|bs",
                 ^~~~~~~~~~~~~~~~~~~~~

In file included from /usr/local/include/php/main/php.h:35,
                 from /tmp/ext-src/trunk/svn.c:30:
/usr/local/include/php/Zend/zend_API.h:304:22: note: declared here
 ZEND_API zend_result zend_parse_parameters(uint32_t num_args, const char *type_spec, ...);
                      ^~~~~~~~~~~~~~~~~~~~~

/tmp/ext-src/trunk/svn.c:55:23: error: 'TSRMLS_C' undeclared (first use in this function); did you mean 'TSRM_H'?
   if (init_svn_client(TSRMLS_C)) RETURN_FALSE; \
                       ^~~~~~~~
/tmp/ext-src/trunk/svn.c:2603:2: note: in expansion of macro 'PHP_SVN_INIT_CLIENT'
  PHP_SVN_INIT_CLIENT();
  ^~~~~~~~~~~~~~~~~~~

/tmp/ext-src/trunk/svn.c:2611:27: error: expected ')' before 'TSRMLS_CC'
   php_svn_handle_error(err TSRMLS_CC);
                           ^~~~~~~~~~
                           )

/tmp/ext-src/trunk/svn.c:2617:2: warning: 'svn_path_canonicalize' is deprecated [-Wdeprecated-declarations]
  APR_ARRAY_PUSH(targets, const char *) = svn_path_canonicalize(utf8_path, subpool);
  ^~~~~~~~~~~~~~

In file included from /tmp/ext-src/trunk/svn.c:40:
/usr/include/subversion-1/svn_path.h:284:1: note: declared here
 svn_path_canonicalize(const char *path, apr_pool_t *pool);
 ^~~~~~~~~~~~~~~~~~~~~

/tmp/ext-src/trunk/svn.c:2620:2: warning: 'svn_client_delete2' is deprecated [-Wdeprecated-declarations]
  err = svn_client_delete2(&info, targets, force, SVN_G(ctx), subpool);
  ^~~

In file included from /tmp/ext-src/trunk/php_svn.h:43,
                 from /tmp/ext-src/trunk/svn.c:33:
/usr/include/subversion-1/svn_client.h:1865:1: note: declared here
 svn_client_delete2(svn_commit_info_t **commit_info_p,
 ^~~~~~~~~~~~~~~~~~

/tmp/ext-src/trunk/svn.c:2624:27: error: expected ')' before 'TSRMLS_CC'
   php_svn_handle_error(err TSRMLS_CC);
                           ^~~~~~~~~~
                           )

/tmp/ext-src/trunk/svn.c: In function 'zif_svn_mkdir':

/tmp/ext-src/trunk/svn.c:2661:55: error: expected ')' before 'TSRMLS_CC'
  if (FAILURE == zend_parse_parameters(ZEND_NUM_ARGS() TSRMLS_CC, "s|s",
                                                       ^~~~~~~~~

/tmp/ext-src/trunk/svn.c:2661:17: error: too few arguments to function 'zend_parse_parameters'
  if (FAILURE == zend_parse_parameters(ZEND_NUM_ARGS() TSRMLS_CC, "s|s",
                 ^~~~~~~~~~~~~~~~~~~~~

In file included from /usr/local/include/php/main/php.h:35,
                 from /tmp/ext-src/trunk/svn.c:30:
/usr/local/include/php/Zend/zend_API.h:304:22: note: declared here
 ZEND_API zend_result zend_parse_parameters(uint32_t num_args, const char *type_spec, ...);
                      ^~~~~~~~~~~~~~~~~~~~~

/tmp/ext-src/trunk/svn.c:55:23: error: 'TSRMLS_C' undeclared (first use in this function); did you mean 'TSRM_H'?
   if (init_svn_client(TSRMLS_C)) RETURN_FALSE; \
                       ^~~~~~~~
/tmp/ext-src/trunk/svn.c:2666:2: note: in expansion of macro 'PHP_SVN_INIT_CLIENT'
  PHP_SVN_INIT_CLIENT();
  ^~~~~~~~~~~~~~~~~~~

/tmp/ext-src/trunk/svn.c:2675:27: error: expected ')' before 'TSRMLS_CC'
   php_svn_handle_error(err TSRMLS_CC);
                           ^~~~~~~~~~
                           )

/tmp/ext-src/trunk/svn.c:2688:2: warning: 'svn_path_canonicalize' is deprecated [-Wdeprecated-declarations]
  APR_ARRAY_PUSH(targets, const char *) = svn_path_canonicalize(utf8_path, subpool);
  ^~~~~~~~~~~~~~

In file included from /tmp/ext-src/trunk/svn.c:40:
/usr/include/subversion-1/svn_path.h:284:1: note: declared here
 svn_path_canonicalize(const char *path, apr_pool_t *pool);
 ^~~~~~~~~~~~~~~~~~~~~

/tmp/ext-src/trunk/svn.c:2690:2: warning: 'svn_client_mkdir2' is deprecated [-Wdeprecated-declarations]
  err = svn_client_mkdir2(&info, targets, SVN_G(ctx), subpool);
  ^~~

In file included from /tmp/ext-src/trunk/php_svn.h:43,
                 from /tmp/ext-src/trunk/svn.c:33:
/usr/include/subversion-1/svn_client.h:1757:1: note: declared here
 svn_client_mkdir2(svn_commit_info_t **commit_info_p,
 ^~~~~~~~~~~~~~~~~

/tmp/ext-src/trunk/svn.c:2695:27: error: expected ')' before 'TSRMLS_CC'
   php_svn_handle_error(err TSRMLS_CC);
                           ^~~~~~~~~~
                           )

/tmp/ext-src/trunk/svn.c: In function 'zif_svn_move':

/tmp/ext-src/trunk/svn.c:2742:55: error: expected ')' before 'TSRMLS_CC'
  if (FAILURE == zend_parse_parameters(ZEND_NUM_ARGS() TSRMLS_CC, "ss|b",
                                                       ^~~~~~~~~

/tmp/ext-src/trunk/svn.c:2742:17: error: too few arguments to function 'zend_parse_parameters'
  if (FAILURE == zend_parse_parameters(ZEND_NUM_ARGS() TSRMLS_CC, "ss|b",
                 ^~~~~~~~~~~~~~~~~~~~~

In file included from /usr/local/include/php/main/php.h:35,
                 from /tmp/ext-src/trunk/svn.c:30:
/usr/local/include/php/Zend/zend_API.h:304:22: note: declared here
 ZEND_API zend_result zend_parse_parameters(uint32_t num_args, const char *type_spec, ...);
                      ^~~~~~~~~~~~~~~~~~~~~

/tmp/ext-src/trunk/svn.c:55:23: error: 'TSRMLS_C' undeclared (first use in this function); did you mean 'TSRM_H'?
   if (init_svn_client(TSRMLS_C)) RETURN_FALSE; \
                       ^~~~~~~~
/tmp/ext-src/trunk/svn.c:2747:2: note: in expansion of macro 'PHP_SVN_INIT_CLIENT'
  PHP_SVN_INIT_CLIENT();
  ^~~~~~~~~~~~~~~~~~~

/tmp/ext-src/trunk/svn.c:2756:27: error: expected ')' before 'TSRMLS_CC'
   php_svn_handle_error(err TSRMLS_CC);
                           ^~~~~~~~~~
                           )

/tmp/ext-src/trunk/svn.c:2762:27: error: expected ')' before 'TSRMLS_CC'
   php_svn_handle_error(err TSRMLS_CC);
                           ^~~~~~~~~~
                           )

/tmp/ext-src/trunk/svn.c:2767:2: warning: 'svn_path_canonicalize' is deprecated [-Wdeprecated-declarations]
  src_path = svn_path_canonicalize(utf8_src_path, subpool);
  ^~~~~~~~

In file included from /tmp/ext-src/trunk/svn.c:40:
/usr/include/subversion-1/svn_path.h:284:1: note: declared here
 svn_path_canonicalize(const char *path, apr_pool_t *pool);
 ^~~~~~~~~~~~~~~~~~~~~

/tmp/ext-src/trunk/svn.c:2768:2: warning: 'svn_path_canonicalize' is deprecated [-Wdeprecated-declarations]
  dst_path = svn_path_canonicalize(utf8_dst_path, subpool);
  ^~~~~~~~

In file included from /tmp/ext-src/trunk/svn.c:40:
/usr/include/subversion-1/svn_path.h:284:1: note: declared here
 svn_path_canonicalize(const char *path, apr_pool_t *pool);
 ^~~~~~~~~~~~~~~~~~~~~

/tmp/ext-src/trunk/svn.c:2770:2: warning: 'svn_client_move3' is deprecated [-Wdeprecated-declarations]
  err = svn_client_move3(&info, src_path, dst_path, force, SVN_G(ctx), subpool);
  ^~~

In file included from /tmp/ext-src/trunk/php_svn.h:43,
                 from /tmp/ext-src/trunk/svn.c:33:
/usr/include/subversion-1/svn_client.h:5623:1: note: declared here
 svn_client_move3(svn_commit_info_t **commit_info_p,
 ^~~~~~~~~~~~~~~~

/tmp/ext-src/trunk/svn.c:2773:27: error: expected ')' before 'TSRMLS_CC'
   php_svn_handle_error(err TSRMLS_CC);
                           ^~~~~~~~~~
                           )

/tmp/ext-src/trunk/svn.c: In function 'zif_svn_proplist':

/tmp/ext-src/trunk/svn.c:2813:55: error: expected ')' before 'TSRMLS_CC'
  if (FAILURE == zend_parse_parameters(ZEND_NUM_ARGS() TSRMLS_CC, "s|bl",
                                                       ^~~~~~~~~

/tmp/ext-src/trunk/svn.c:2813:17: error: too few arguments to function 'zend_parse_parameters'
  if (FAILURE == zend_parse_parameters(ZEND_NUM_ARGS() TSRMLS_CC, "s|bl",
                 ^~~~~~~~~~~~~~~~~~~~~

In file included from /usr/local/include/php/main/php.h:35,
                 from /tmp/ext-src/trunk/svn.c:30:
/usr/local/include/php/Zend/zend_API.h:304:22: note: declared here
 ZEND_API zend_result zend_parse_parameters(uint32_t num_args, const char *type_spec, ...);
                      ^~~~~~~~~~~~~~~~~~~~~

/tmp/ext-src/trunk/svn.c:55:23: error: 'TSRMLS_C' undeclared (first use in this function); did you mean 'TSRM_H'?
   if (init_svn_client(TSRMLS_C)) RETURN_FALSE; \
                       ^~~~~~~~
/tmp/ext-src/trunk/svn.c:2818:2: note: in expansion of macro 'PHP_SVN_INIT_CLIENT'
  PHP_SVN_INIT_CLIENT();
  ^~~~~~~~~~~~~~~~~~~

/tmp/ext-src/trunk/svn.c:2827:27: error: expected ')' before 'TSRMLS_CC'
   php_svn_handle_error(err TSRMLS_CC);
                           ^~~~~~~~~~
                           )

/tmp/ext-src/trunk/svn.c:2832:2: warning: 'svn_path_canonicalize' is deprecated [-Wdeprecated-declarations]
  path = svn_path_canonicalize(utf8_path, subpool);
  ^~~~

In file included from /tmp/ext-src/trunk/svn.c:40:
/usr/include/subversion-1/svn_path.h:284:1: note: declared here
 svn_path_canonicalize(const char *path, apr_pool_t *pool);
 ^~~~~~~~~~~~~~~~~~~~~

/tmp/ext-src/trunk/svn.c:2838:27: error: expected ')' before 'TSRMLS_CC'
   php_svn_handle_error(err TSRMLS_CC);
                           ^~~~~~~~~~
                           )

/tmp/ext-src/trunk/svn.c:2843:2: warning: 'svn_client_proplist2' is deprecated [-Wdeprecated-declarations]
  err = svn_client_proplist2(&props, true_path, &peg_revision, &revision, recurse, SVN_G(ctx), subpool);
  ^~~

In file included from /tmp/ext-src/trunk/php_svn.h:43,
                 from /tmp/ext-src/trunk/svn.c:33:
/usr/include/subversion-1/svn_client.h:6179:1: note: declared here
 svn_client_proplist2(apr_array_header_t **props,
 ^~~~~~~~~~~~~~~~~~~~

/tmp/ext-src/trunk/svn.c:2846:27: error: expected ')' before 'TSRMLS_CC'
   php_svn_handle_error(err TSRMLS_CC);
                           ^~~~~~~~~~
                           )

/tmp/ext-src/trunk/svn.c:2870:4: warning: 'svn_path_local_style' is deprecated [-Wdeprecated-declarations]
    add_assoc_zval(return_value, (char *)svn_path_local_style(item->node_name->data, subpool), &row);
    ^~~~~~~~~~~~~~

In file included from /tmp/ext-src/trunk/svn.c:40:
/usr/include/subversion-1/svn_path.h:82:1: note: declared here
 svn_path_local_style(const char *path, apr_pool_t *pool);
 ^~~~~~~~~~~~~~~~~~~~

/tmp/ext-src/trunk/svn.c:2870:4: warning: 'svn_path_local_style' is deprecated [-Wdeprecated-declarations]
    add_assoc_zval(return_value, (char *)svn_path_local_style(item->node_name->data, subpool), &row);
    ^~~~~~~~~~~~~~

In file included from /tmp/ext-src/trunk/svn.c:40:
/usr/include/subversion-1/svn_path.h:82:1: note: declared here
 svn_path_local_style(const char *path, apr_pool_t *pool);
 ^~~~~~~~~~~~~~~~~~~~

/tmp/ext-src/trunk/svn.c: In function 'zif_svn_propget':

/tmp/ext-src/trunk/svn.c:2895:55: error: expected ')' before 'TSRMLS_CC'
  if (FAILURE == zend_parse_parameters(ZEND_NUM_ARGS() TSRMLS_CC, "ss|bl",
                                                       ^~~~~~~~~

/tmp/ext-src/trunk/svn.c:2895:17: error: too few arguments to function 'zend_parse_parameters'
  if (FAILURE == zend_parse_parameters(ZEND_NUM_ARGS() TSRMLS_CC, "ss|bl",
                 ^~~~~~~~~~~~~~~~~~~~~

In file included from /usr/local/include/php/main/php.h:35,
                 from /tmp/ext-src/trunk/svn.c:30:
/usr/local/include/php/Zend/zend_API.h:304:22: note: declared here
 ZEND_API zend_result zend_parse_parameters(uint32_t num_args, const char *type_spec, ...);
                      ^~~~~~~~~~~~~~~~~~~~~

/tmp/ext-src/trunk/svn.c:55:23: error: 'TSRMLS_C' undeclared (first use in this function); did you mean 'TSRM_H'?
   if (init_svn_client(TSRMLS_C)) RETURN_FALSE; \
                       ^~~~~~~~
/tmp/ext-src/trunk/svn.c:2900:2: note: in expansion of macro 'PHP_SVN_INIT_CLIENT'
  PHP_SVN_INIT_CLIENT();
  ^~~~~~~~~~~~~~~~~~~

/tmp/ext-src/trunk/svn.c:2908:27: error: expected ')' before 'TSRMLS_CC'
   php_svn_handle_error(err TSRMLS_CC);
                           ^~~~~~~~~~
                           )

/tmp/ext-src/trunk/svn.c:2913:2: warning: 'svn_path_canonicalize' is deprecated [-Wdeprecated-declarations]
  path = svn_path_canonicalize(utf8_path, subpool);
  ^~~~

In file included from /tmp/ext-src/trunk/svn.c:40:
/usr/include/subversion-1/svn_path.h:284:1: note: declared here
 svn_path_canonicalize(const char *path, apr_pool_t *pool);
 ^~~~~~~~~~~~~~~~~~~~~

/tmp/ext-src/trunk/svn.c:2919:27: error: expected ')' before 'TSRMLS_CC'
   php_svn_handle_error(err TSRMLS_CC);
                           ^~~~~~~~~~
                           )

/tmp/ext-src/trunk/svn.c:2924:2: warning: 'svn_client_propget2' is deprecated [-Wdeprecated-declarations]
  err = svn_client_propget2(&props, propname, true_path, &peg_revision, &revision, recurse, SVN_G(ctx), subpool);
  ^~~

In file included from /tmp/ext-src/trunk/php_svn.h:43,
                 from /tmp/ext-src/trunk/svn.c:33:
/usr/include/subversion-1/svn_client.h:6038:1: note: declared here
 svn_client_propget2(apr_hash_t **props,
 ^~~~~~~~~~~~~~~~~~~

/tmp/ext-src/trunk/svn.c:2927:27: error: expected ')' before 'TSRMLS_CC'
   php_svn_handle_error(err TSRMLS_CC);
                           ^~~~~~~~~~
                           )

/tmp/ext-src/trunk/svn.c:2945:4: warning: 'svn_path_local_style' is deprecated [-Wdeprecated-declarations]
    add_assoc_zval(return_value, (char *)svn_path_local_style(pname, subpool), &row);
    ^~~~~~~~~~~~~~

In file included from /tmp/ext-src/trunk/svn.c:40:
/usr/include/subversion-1/svn_path.h:82:1: note: declared here
 svn_path_local_style(const char *path, apr_pool_t *pool);
 ^~~~~~~~~~~~~~~~~~~~

/tmp/ext-src/trunk/svn.c:2945:4: warning: 'svn_path_local_style' is deprecated [-Wdeprecated-declarations]
    add_assoc_zval(return_value, (char *)svn_path_local_style(pname, subpool), &row);
    ^~~~~~~~~~~~~~

In file included from /tmp/ext-src/trunk/svn.c:40:
/usr/include/subversion-1/svn_path.h:82:1: note: declared here
 svn_path_local_style(const char *path, apr_pool_t *pool);
 ^~~~~~~~~~~~~~~~~~~~

/tmp/ext-src/trunk/svn.c: In function 'zif_svn_propset':

/tmp/ext-src/trunk/svn.c:2969:55: error: expected ')' before 'TSRMLS_CC'
  if (FAILURE == zend_parse_parameters(ZEND_NUM_ARGS() TSRMLS_CC, "sss|bbl",
                                                       ^~~~~~~~~

/tmp/ext-src/trunk/svn.c:2969:17: error: too few arguments to function 'zend_parse_parameters'
  if (FAILURE == zend_parse_parameters(ZEND_NUM_ARGS() TSRMLS_CC, "sss|bbl",
                 ^~~~~~~~~~~~~~~~~~~~~

In file included from /usr/local/include/php/main/php.h:35,
                 from /tmp/ext-src/trunk/svn.c:30:
/usr/local/include/php/Zend/zend_API.h:304:22: note: declared here
 ZEND_API zend_result zend_parse_parameters(uint32_t num_args, const char *type_spec, ...);
                      ^~~~~~~~~~~~~~~~~~~~~

/tmp/ext-src/trunk/svn.c:55:23: error: 'TSRMLS_C' undeclared (first use in this function); did you mean 'TSRM_H'?
   if (init_svn_client(TSRMLS_C)) RETURN_FALSE; \
                       ^~~~~~~~
/tmp/ext-src/trunk/svn.c:2974:2: note: in expansion of macro 'PHP_SVN_INIT_CLIENT'
  PHP_SVN_INIT_CLIENT();
  ^~~~~~~~~~~~~~~~~~~

/tmp/ext-src/trunk/svn.c:2982:27: error: expected ')' before 'TSRMLS_CC'
   php_svn_handle_error(err TSRMLS_CC);
                           ^~~~~~~~~~
                           )

/tmp/ext-src/trunk/svn.c:2987:2: warning: 'svn_path_canonicalize' is deprecated [-Wdeprecated-declarations]
  path = svn_path_canonicalize(utf8_path, subpool);
  ^~~~

In file included from /tmp/ext-src/trunk/svn.c:40:
/usr/include/subversion-1/svn_path.h:284:1: note: declared here
 svn_path_canonicalize(const char *path, apr_pool_t *pool);
 ^~~~~~~~~~~~~~~~~~~~~

/tmp/ext-src/trunk/svn.c:2993:27: error: expected ')' before 'TSRMLS_CC'
   php_svn_handle_error(err TSRMLS_CC);
                           ^~~~~~~~~~
                           )

/tmp/ext-src/trunk/svn.c:2998:2: warning: 'svn_client_propset2' is deprecated [-Wdeprecated-declarations]
  err = svn_client_propset2(propname, svn_string_ncreate(propval, propvallen, subpool), true_path, recurse, skip_checks, SVN_G(ctx), subpool);
  ^~~

In file included from /tmp/ext-src/trunk/php_svn.h:43,
                 from /tmp/ext-src/trunk/svn.c:33:
/usr/include/subversion-1/svn_client.h:5808:1: note: declared here
 svn_client_propset2(const char *propname,
 ^~~~~~~~~~~~~~~~~~~

/tmp/ext-src/trunk/svn.c:3001:27: error: expected ')' before 'TSRMLS_CC'
   php_svn_handle_error(err TSRMLS_CC);
                           ^~~~~~~~~~
                           )

/tmp/ext-src/trunk/svn.c: In function 'zif_svn_prop_delete':

/tmp/ext-src/trunk/svn.c:3027:55: error: expected ')' before 'TSRMLS_CC'
  if (FAILURE == zend_parse_parameters(ZEND_NUM_ARGS() TSRMLS_CC, "ss|bbl",
                                                       ^~~~~~~~~

/tmp/ext-src/trunk/svn.c:3027:17: error: too few arguments to function 'zend_parse_parameters'
  if (FAILURE == zend_parse_parameters(ZEND_NUM_ARGS() TSRMLS_CC, "ss|bbl",
                 ^~~~~~~~~~~~~~~~~~~~~

In file included from /usr/local/include/php/main/php.h:35,
                 from /tmp/ext-src/trunk/svn.c:30:
/usr/local/include/php/Zend/zend_API.h:304:22: note: declared here
 ZEND_API zend_result zend_parse_parameters(uint32_t num_args, const char *type_spec, ...);
                      ^~~~~~~~~~~~~~~~~~~~~

/tmp/ext-src/trunk/svn.c:55:23: error: 'TSRMLS_C' undeclared (first use in this function); did you mean 'TSRM_H'?
   if (init_svn_client(TSRMLS_C)) RETURN_FALSE; \
                       ^~~~~~~~
/tmp/ext-src/trunk/svn.c:3032:2: note: in expansion of macro 'PHP_SVN_INIT_CLIENT'
  PHP_SVN_INIT_CLIENT();
  ^~~~~~~~~~~~~~~~~~~

/tmp/ext-src/trunk/svn.c:3040:27: error: expected ')' before 'TSRMLS_CC'
   php_svn_handle_error(err TSRMLS_CC);
                           ^~~~~~~~~~
                           )

/tmp/ext-src/trunk/svn.c:3045:2: warning: 'svn_path_canonicalize' is deprecated [-Wdeprecated-declarations]
  path = svn_path_canonicalize(utf8_path, subpool);
  ^~~~

In file included from /tmp/ext-src/trunk/svn.c:40:
/usr/include/subversion-1/svn_path.h:284:1: note: declared here
 svn_path_canonicalize(const char *path, apr_pool_t *pool);
 ^~~~~~~~~~~~~~~~~~~~~

/tmp/ext-src/trunk/svn.c:3051:27: error: expected ')' before 'TSRMLS_CC'
   php_svn_handle_error(err TSRMLS_CC);
                           ^~~~~~~~~~
                           )

/tmp/ext-src/trunk/svn.c:3056:2: warning: 'svn_client_propset2' is deprecated [-Wdeprecated-declarations]
  err = svn_client_propset2(propname, NULL, true_path, recurse, skip_checks, SVN_G(ctx), subpool);
  ^~~

In file included from /tmp/ext-src/trunk/php_svn.h:43,
                 from /tmp/ext-src/trunk/svn.c:33:
/usr/include/subversion-1/svn_client.h:5808:1: note: declared here
 svn_client_propset2(const char *propname,
 ^~~~~~~~~~~~~~~~~~~

/tmp/ext-src/trunk/svn.c:3059:27: error: expected ')' before 'TSRMLS_CC'
   php_svn_handle_error(err TSRMLS_CC);
                           ^~~~~~~~~~
                           )

/tmp/ext-src/trunk/svn.c: In function 'zif_svn_revprop_get':

/tmp/ext-src/trunk/svn.c:3085:55: error: expected ')' before 'TSRMLS_CC'
  if (FAILURE == zend_parse_parameters(ZEND_NUM_ARGS() TSRMLS_CC, "sls",
                                                       ^~~~~~~~~

/tmp/ext-src/trunk/svn.c:3085:17: error: too few arguments to function 'zend_parse_parameters'
  if (FAILURE == zend_parse_parameters(ZEND_NUM_ARGS() TSRMLS_CC, "sls",
                 ^~~~~~~~~~~~~~~~~~~~~

In file included from /usr/local/include/php/main/php.h:35,
                 from /tmp/ext-src/trunk/svn.c:30:
/usr/local/include/php/Zend/zend_API.h:304:22: note: declared here
 ZEND_API zend_result zend_parse_parameters(uint32_t num_args, const char *type_spec, ...);
                      ^~~~~~~~~~~~~~~~~~~~~

/tmp/ext-src/trunk/svn.c:55:23: error: 'TSRMLS_C' undeclared (first use in this function); did you mean 'TSRM_H'?
   if (init_svn_client(TSRMLS_C)) RETURN_FALSE; \
                       ^~~~~~~~
/tmp/ext-src/trunk/svn.c:3090:2: note: in expansion of macro 'PHP_SVN_INIT_CLIENT'
  PHP_SVN_INIT_CLIENT();
  ^~~~~~~~~~~~~~~~~~~

/tmp/ext-src/trunk/svn.c:3098:27: error: expected ')' before 'TSRMLS_CC'
   php_svn_handle_error(err TSRMLS_CC);
                           ^~~~~~~~~~
                           )

/tmp/ext-src/trunk/svn.c:3104:27: error: expected ')' before 'TSRMLS_CC'
   php_svn_handle_error(err TSRMLS_CC);
                           ^~~~~~~~~~
                           )

/tmp/ext-src/trunk/svn.c:3109:2: warning: 'svn_path_canonicalize' is deprecated [-Wdeprecated-declarations]
  url = svn_path_canonicalize(utf8_url, subpool);
  ^~~

In file included from /tmp/ext-src/trunk/svn.c:40:
/usr/include/subversion-1/svn_path.h:284:1: note: declared here
 svn_path_canonicalize(const char *path, apr_pool_t *pool);
 ^~~~~~~~~~~~~~~~~~~~~

/tmp/ext-src/trunk/svn.c:3117:27: error: expected ')' before 'TSRMLS_CC'
   php_svn_handle_error(err TSRMLS_CC);
                           ^~~~~~~~~~
                           )

/tmp/ext-src/trunk/svn.c: In function 'zif_svn_revprop_set':

/tmp/ext-src/trunk/svn.c:3145:55: error: expected ')' before 'TSRMLS_CC'
  if (FAILURE == zend_parse_parameters(ZEND_NUM_ARGS() TSRMLS_CC, "slss|b",
                                                       ^~~~~~~~~

/tmp/ext-src/trunk/svn.c:3145:17: error: too few arguments to function 'zend_parse_parameters'
  if (FAILURE == zend_parse_parameters(ZEND_NUM_ARGS() TSRMLS_CC, "slss|b",
                 ^~~~~~~~~~~~~~~~~~~~~

In file included from /usr/local/include/php/main/php.h:35,
                 from /tmp/ext-src/trunk/svn.c:30:
/usr/local/include/php/Zend/zend_API.h:304:22: note: declared here
 ZEND_API zend_result zend_parse_parameters(uint32_t num_args, const char *type_spec, ...);
                      ^~~~~~~~~~~~~~~~~~~~~

/tmp/ext-src/trunk/svn.c:55:23: error: 'TSRMLS_C' undeclared (first use in this function); did you mean 'TSRM_H'?
   if (init_svn_client(TSRMLS_C)) RETURN_FALSE; \
                       ^~~~~~~~
/tmp/ext-src/trunk/svn.c:3150:2: note: in expansion of macro 'PHP_SVN_INIT_CLIENT'
  PHP_SVN_INIT_CLIENT();
  ^~~~~~~~~~~~~~~~~~~

/tmp/ext-src/trunk/svn.c:3158:27: error: expected ')' before 'TSRMLS_CC'
   php_svn_handle_error(err TSRMLS_CC);
                           ^~~~~~~~~~
                           )

/tmp/ext-src/trunk/svn.c:3164:27: error: expected ')' before 'TSRMLS_CC'
   php_svn_handle_error(err TSRMLS_CC);
                           ^~~~~~~~~~
                           )

/tmp/ext-src/trunk/svn.c:3169:2: warning: 'svn_path_canonicalize' is deprecated [-Wdeprecated-declarations]
  url = svn_path_canonicalize(utf8_url, subpool);
  ^~~

In file included from /tmp/ext-src/trunk/svn.c:40:
/usr/include/subversion-1/svn_path.h:284:1: note: declared here
 svn_path_canonicalize(const char *path, apr_pool_t *pool);
 ^~~~~~~~~~~~~~~~~~~~~

/tmp/ext-src/trunk/svn.c:3173:2: warning: 'svn_client_revprop_set' is deprecated [-Wdeprecated-declarations]
  err = svn_client_revprop_set (
  ^~~

In file included from /tmp/ext-src/trunk/php_svn.h:43,
                 from /tmp/ext-src/trunk/svn.c:33:
/usr/include/subversion-1/svn_client.h:5894:1: note: declared here
 svn_client_revprop_set(const char *propname,
 ^~~~~~~~~~~~~~~~~~~~~~

/tmp/ext-src/trunk/svn.c:3177:27: error: expected ')' before 'TSRMLS_CC'
   php_svn_handle_error(err TSRMLS_CC);
                           ^~~~~~~~~~
                           )

/tmp/ext-src/trunk/svn.c: In function 'zif_svn_revprop_delete':

/tmp/ext-src/trunk/svn.c:3202:55: error: expected ')' before 'TSRMLS_CC'
  if (FAILURE == zend_parse_parameters(ZEND_NUM_ARGS() TSRMLS_CC, "sls",
                                                       ^~~~~~~~~

/tmp/ext-src/trunk/svn.c:3202:17: error: too few arguments to function 'zend_parse_parameters'
  if (FAILURE == zend_parse_parameters(ZEND_NUM_ARGS() TSRMLS_CC, "sls",
                 ^~~~~~~~~~~~~~~~~~~~~

In file included from /usr/local/include/php/main/php.h:35,
                 from /tmp/ext-src/trunk/svn.c:30:
/usr/local/include/php/Zend/zend_API.h:304:22: note: declared here
 ZEND_API zend_result zend_parse_parameters(uint32_t num_args, const char *type_spec, ...);
                      ^~~~~~~~~~~~~~~~~~~~~

/tmp/ext-src/trunk/svn.c:55:23: error: 'TSRMLS_C' undeclared (first use in this function); did you mean 'TSRM_H'?
   if (init_svn_client(TSRMLS_C)) RETURN_FALSE; \
                       ^~~~~~~~
/tmp/ext-src/trunk/svn.c:3207:2: note: in expansion of macro 'PHP_SVN_INIT_CLIENT'
  PHP_SVN_INIT_CLIENT();
  ^~~~~~~~~~~~~~~~~~~

/tmp/ext-src/trunk/svn.c:3215:27: error: expected ')' before 'TSRMLS_CC'
   php_svn_handle_error(err TSRMLS_CC);
                           ^~~~~~~~~~
                           )

/tmp/ext-src/trunk/svn.c:3221:27: error: expected ')' before 'TSRMLS_CC'
   php_svn_handle_error(err TSRMLS_CC);
                           ^~~~~~~~~~
                           )

/tmp/ext-src/trunk/svn.c:3226:2: warning: 'svn_path_canonicalize' is deprecated [-Wdeprecated-declarations]
  url = svn_path_canonicalize(utf8_url, subpool);
  ^~~

In file included from /tmp/ext-src/trunk/svn.c:40:
/usr/include/subversion-1/svn_path.h:284:1: note: declared here
 svn_path_canonicalize(const char *path, apr_pool_t *pool);
 ^~~~~~~~~~~~~~~~~~~~~

/tmp/ext-src/trunk/svn.c:3230:2: warning: 'svn_client_revprop_set' is deprecated [-Wdeprecated-declarations]
  err = svn_client_revprop_set (
  ^~~

In file included from /tmp/ext-src/trunk/php_svn.h:43,
                 from /tmp/ext-src/trunk/svn.c:33:
/usr/include/subversion-1/svn_client.h:5894:1: note: declared here
 svn_client_revprop_set(const char *propname,
 ^~~~~~~~~~~~~~~~~~~~~~

/tmp/ext-src/trunk/svn.c:3234:27: error: expected ')' before 'TSRMLS_CC'
   php_svn_handle_error(err TSRMLS_CC);
                           ^~~~~~~~~~
                           )

/tmp/ext-src/trunk/svn.c: In function 'zif_svn_repos_create':

/tmp/ext-src/trunk/svn.c:3263:55: error: expected ')' before 'TSRMLS_CC'
  if (FAILURE == zend_parse_parameters(ZEND_NUM_ARGS() TSRMLS_CC, "s|a!a!",
                                                       ^~~~~~~~~

/tmp/ext-src/trunk/svn.c:3263:17: error: too few arguments to function 'zend_parse_parameters'
  if (FAILURE == zend_parse_parameters(ZEND_NUM_ARGS() TSRMLS_CC, "s|a!a!",
                 ^~~~~~~~~~~~~~~~~~~~~

In file included from /usr/local/include/php/main/php.h:35,
                 from /tmp/ext-src/trunk/svn.c:30:
/usr/local/include/php/Zend/zend_API.h:304:22: note: declared here
 ZEND_API zend_result zend_parse_parameters(uint32_t num_args, const char *type_spec, ...);
                      ^~~~~~~~~~~~~~~~~~~~~

/tmp/ext-src/trunk/svn.c:55:23: error: 'TSRMLS_C' undeclared (first use in this function); did you mean 'TSRM_H'?
   if (init_svn_client(TSRMLS_C)) RETURN_FALSE; \
                       ^~~~~~~~
/tmp/ext-src/trunk/svn.c:3268:2: note: in expansion of macro 'PHP_SVN_INIT_CLIENT'
  PHP_SVN_INIT_CLIENT();
  ^~~~~~~~~~~~~~~~~~~

/tmp/ext-src/trunk/svn.c:3276:27: error: expected ')' before 'TSRMLS_CC'
   php_svn_handle_error(err TSRMLS_CC);
                           ^~~~~~~~~~
                           )

/tmp/ext-src/trunk/svn.c:3281:2: warning: 'svn_path_canonicalize' is deprecated [-Wdeprecated-declarations]
  path = svn_path_canonicalize(utf8_path, subpool);
  ^~~~

In file included from /tmp/ext-src/trunk/svn.c:40:
/usr/include/subversion-1/svn_path.h:284:1: note: declared here
 svn_path_canonicalize(const char *path, apr_pool_t *pool);
 ^~~~~~~~~~~~~~~~~~~~~

/tmp/ext-src/trunk/svn.c:3283:16: warning: implicit declaration of function 'replicate_zend_hash_to_apr_hash' [-Wimplicit-function-declaration]
  config_hash = replicate_zend_hash_to_apr_hash(config, subpool TSRMLS_CC);
                ^~~~~~~~~~~~~~~~~~~~~~~~~~~~~~~

/tmp/ext-src/trunk/svn.c:3283:63: error: expected ')' before 'TSRMLS_CC'
  config_hash = replicate_zend_hash_to_apr_hash(config, subpool TSRMLS_CC);
                                                               ^~~~~~~~~~
                                                               )

/tmp/ext-src/trunk/svn.c:3283:14: warning: assignment to 'apr_hash_t *' {aka 'struct apr_hash_t *'} from 'int' makes pointer from integer without a cast [-Wint-conversion]
  config_hash = replicate_zend_hash_to_apr_hash(config, subpool TSRMLS_CC);
              ^

/tmp/ext-src/trunk/svn.c:3284:67: error: expected ')' before 'TSRMLS_CC'
  fsconfig_hash = replicate_zend_hash_to_apr_hash(fsconfig, subpool TSRMLS_CC);
                                                                   ^~~~~~~~~~
                                                                   )

/tmp/ext-src/trunk/svn.c:3284:16: warning: assignment to 'apr_hash_t *' {aka 'struct apr_hash_t *'} from 'int' makes pointer from integer without a cast [-Wint-conversion]
  fsconfig_hash = replicate_zend_hash_to_apr_hash(fsconfig, subpool TSRMLS_CC);
                ^

/tmp/ext-src/trunk/svn.c:3289:27: error: expected ')' before 'TSRMLS_CC'
   php_svn_handle_error(err TSRMLS_CC);
                           ^~~~~~~~~~
                           )

/tmp/ext-src/trunk/svn.c: In function 'zif_svn_repos_recover':

/tmp/ext-src/trunk/svn.c:3315:55: error: expected ')' before 'TSRMLS_CC'
  if (FAILURE == zend_parse_parameters(ZEND_NUM_ARGS() TSRMLS_CC, "s",
                                                       ^~~~~~~~~

/tmp/ext-src/trunk/svn.c:3315:17: error: too few arguments to function 'zend_parse_parameters'
  if (FAILURE == zend_parse_parameters(ZEND_NUM_ARGS() TSRMLS_CC, "s",
                 ^~~~~~~~~~~~~~~~~~~~~

In file included from /usr/local/include/php/main/php.h:35,
                 from /tmp/ext-src/trunk/svn.c:30:
/usr/local/include/php/Zend/zend_API.h:304:22: note: declared here
 ZEND_API zend_result zend_parse_parameters(uint32_t num_args, const char *type_spec, ...);
                      ^~~~~~~~~~~~~~~~~~~~~

/tmp/ext-src/trunk/svn.c:55:23: error: 'TSRMLS_C' undeclared (first use in this function); did you mean 'TSRM_H'?
   if (init_svn_client(TSRMLS_C)) RETURN_FALSE; \
                       ^~~~~~~~
/tmp/ext-src/trunk/svn.c:3320:2: note: in expansion of macro 'PHP_SVN_INIT_CLIENT'
  PHP_SVN_INIT_CLIENT();
  ^~~~~~~~~~~~~~~~~~~

/tmp/ext-src/trunk/svn.c:3328:27: error: expected ')' before 'TSRMLS_CC'
   php_svn_handle_error(err TSRMLS_CC);
                           ^~~~~~~~~~
                           )

/tmp/ext-src/trunk/svn.c:3332:2: warning: 'svn_path_canonicalize' is deprecated [-Wdeprecated-declarations]
  path = svn_path_canonicalize(utf8_path, subpool);
  ^~~~

In file included from /tmp/ext-src/trunk/svn.c:40:
/usr/include/subversion-1/svn_path.h:284:1: note: declared here
 svn_path_canonicalize(const char *path, apr_pool_t *pool);
 ^~~~~~~~~~~~~~~~~~~~~

/tmp/ext-src/trunk/svn.c:3334:2: warning: 'svn_repos_recover2' is deprecated [-Wdeprecated-declarations]
  err = svn_repos_recover2(path, 0, NULL, NULL, subpool);
  ^~~

In file included from /tmp/ext-src/trunk/svn.c:42:
/usr/include/subversion-1/svn_repos.h:819:1: note: declared here
 svn_repos_recover2(const char *path,
 ^~~~~~~~~~~~~~~~~~

/tmp/ext-src/trunk/svn.c:3337:27: error: expected ')' before 'TSRMLS_CC'
   php_svn_handle_error(err TSRMLS_CC);
                           ^~~~~~~~~~
                           )

/tmp/ext-src/trunk/svn.c: In function 'zif_svn_repos_hotcopy':

/tmp/ext-src/trunk/svn.c:3360:55: error: expected ')' before 'TSRMLS_CC'
  if (FAILURE == zend_parse_parameters(ZEND_NUM_ARGS() TSRMLS_CC, "ssb",
                                                       ^~~~~~~~~

/tmp/ext-src/trunk/svn.c:3360:17: error: too few arguments to function 'zend_parse_parameters'
  if (FAILURE == zend_parse_parameters(ZEND_NUM_ARGS() TSRMLS_CC, "ssb",
                 ^~~~~~~~~~~~~~~~~~~~~

In file included from /usr/local/include/php/main/php.h:35,
                 from /tmp/ext-src/trunk/svn.c:30:
/usr/local/include/php/Zend/zend_API.h:304:22: note: declared here
 ZEND_API zend_result zend_parse_parameters(uint32_t num_args, const char *type_spec, ...);
                      ^~~~~~~~~~~~~~~~~~~~~

/tmp/ext-src/trunk/svn.c:55:23: error: 'TSRMLS_C' undeclared (first use in this function); did you mean 'TSRM_H'?
   if (init_svn_client(TSRMLS_C)) RETURN_FALSE; \
                       ^~~~~~~~
/tmp/ext-src/trunk/svn.c:3365:2: note: in expansion of macro 'PHP_SVN_INIT_CLIENT'
  PHP_SVN_INIT_CLIENT();
  ^~~~~~~~~~~~~~~~~~~

/tmp/ext-src/trunk/svn.c:3373:27: error: expected ')' before 'TSRMLS_CC'
   php_svn_handle_error(err TSRMLS_CC);
                           ^~~~~~~~~~
                           )

/tmp/ext-src/trunk/svn.c:3379:27: error: expected ')' before 'TSRMLS_CC'
   php_svn_handle_error(err TSRMLS_CC);
                           ^~~~~~~~~~
                           )

/tmp/ext-src/trunk/svn.c:3384:2: warning: 'svn_path_canonicalize' is deprecated [-Wdeprecated-declarations]
  src_path = svn_path_canonicalize(utf8_src_path, subpool);
  ^~~~~~~~

In file included from /tmp/ext-src/trunk/svn.c:40:
/usr/include/subversion-1/svn_path.h:284:1: note: declared here
 svn_path_canonicalize(const char *path, apr_pool_t *pool);
 ^~~~~~~~~~~~~~~~~~~~~

/tmp/ext-src/trunk/svn.c:3385:2: warning: 'svn_path_canonicalize' is deprecated [-Wdeprecated-declarations]
  dst_path = svn_path_canonicalize(utf8_dst_path, subpool);
  ^~~~~~~~

In file included from /tmp/ext-src/trunk/svn.c:40:
/usr/include/subversion-1/svn_path.h:284:1: note: declared here
 svn_path_canonicalize(const char *path, apr_pool_t *pool);
 ^~~~~~~~~~~~~~~~~~~~~

/tmp/ext-src/trunk/svn.c:3387:2: warning: 'svn_repos_hotcopy' is deprecated [-Wdeprecated-declarations]
  err = svn_repos_hotcopy(src_path, dst_path, cleanlogs, subpool);
  ^~~

In file included from /tmp/ext-src/trunk/svn.c:42:
/usr/include/subversion-1/svn_repos.h:723:1: note: declared here
 svn_repos_hotcopy(const char *src_path,
 ^~~~~~~~~~~~~~~~~

/tmp/ext-src/trunk/svn.c:3390:27: error: expected ')' before 'TSRMLS_CC'
   php_svn_handle_error(err TSRMLS_CC);
                           ^~~~~~~~~~
                           )

/tmp/ext-src/trunk/svn.c: At top level:

/tmp/ext-src/trunk/svn.c:3402:40: error: expected ';', ',' or ')' before 'TSRMLS_DC'
 static int replicate_array(zval *pDest TSRMLS_DC, int num_args, va_list args, zend_hash_key *key)
                                        ^~~~~~~~~

/tmp/ext-src/trunk/svn.c:3420:89: error: expected ';', ',' or ')' before 'TSRMLS_DC'
 static apr_array_header_t *replicate_zend_hash_to_apr_array(zval *arr, apr_pool_t *pool TSRMLS_DC)
                                                                                         ^~~~~~~~~

/tmp/ext-src/trunk/svn.c: In function 'zif_svn_commit':

/tmp/ext-src/trunk/svn.c:3447:83: error: expected ')' before 'TSRMLS_CC'
  if (FAILURE == zend_parse_parameters_ex(ZEND_PARSE_PARAMS_QUIET, ZEND_NUM_ARGS() TSRMLS_CC, "ss|b",
                                                                                   ^~~~~~~~~

/tmp/ext-src/trunk/svn.c:3447:17: error: too few arguments to function 'zend_parse_parameters_ex'
  if (FAILURE == zend_parse_parameters_ex(ZEND_PARSE_PARAMS_QUIET, ZEND_NUM_ARGS() TSRMLS_CC, "ss|b",
                 ^~~~~~~~~~~~~~~~~~~~~~~~

In file included from /usr/local/include/php/main/php.h:35,
                 from /tmp/ext-src/trunk/svn.c:30:
/usr/local/include/php/Zend/zend_API.h:305:22: note: declared here
 ZEND_API zend_result zend_parse_parameters_ex(int flags, uint32_t num_args, const char *type_spec, ...);
                      ^~~~~~~~~~~~~~~~~~~~~~~~

/tmp/ext-src/trunk/svn.c:3449:56: error: expected ')' before 'TSRMLS_CC'
   if (FAILURE == zend_parse_parameters(ZEND_NUM_ARGS() TSRMLS_CC, "sa|b",
                                                        ^~~~~~~~~

/tmp/ext-src/trunk/svn.c:3449:18: error: too few arguments to function 'zend_parse_parameters'
   if (FAILURE == zend_parse_parameters(ZEND_NUM_ARGS() TSRMLS_CC, "sa|b",
                  ^~~~~~~~~~~~~~~~~~~~~

In file included from /usr/local/include/php/main/php.h:35,
                 from /tmp/ext-src/trunk/svn.c:30:
/usr/local/include/php/Zend/zend_API.h:304:22: note: declared here
 ZEND_API zend_result zend_parse_parameters(uint32_t num_args, const char *type_spec, ...);
                      ^~~~~~~~~~~~~~~~~~~~~

/tmp/ext-src/trunk/svn.c:55:23: error: 'TSRMLS_C' undeclared (first use in this function); did you mean 'TSRM_H'?
   if (init_svn_client(TSRMLS_C)) RETURN_FALSE; \
                       ^~~~~~~~
/tmp/ext-src/trunk/svn.c:3455:2: note: in expansion of macro 'PHP_SVN_INIT_CLIENT'
  PHP_SVN_INIT_CLIENT();
  ^~~~~~~~~~~~~~~~~~~

/tmp/ext-src/trunk/svn.c:3466:28: error: expected ')' before 'TSRMLS_CC'
    php_svn_handle_error(err TSRMLS_CC);
                            ^~~~~~~~~~
                            )

/tmp/ext-src/trunk/svn.c:3470:3: warning: 'svn_path_canonicalize' is deprecated [-Wdeprecated-declarations]
   path = svn_path_canonicalize(utf8_path, subpool);
   ^~~~

In file included from /tmp/ext-src/trunk/svn.c:40:
/usr/include/subversion-1/svn_path.h:284:1: note: declared here
 svn_path_canonicalize(const char *path, apr_pool_t *pool);
 ^~~~~~~~~~~~~~~~~~~~~

/tmp/ext-src/trunk/svn.c:3476:19: warning: implicit declaration of function 'replicate_zend_hash_to_apr_array' [-Wimplicit-function-declaration]
   targets_array = replicate_zend_hash_to_apr_array(targets, subpool TSRMLS_CC);
                   ^~~~~~~~~~~~~~~~~~~~~~~~~~~~~~~~

/tmp/ext-src/trunk/svn.c:3476:68: error: expected ')' before 'TSRMLS_CC'
   targets_array = replicate_zend_hash_to_apr_array(targets, subpool TSRMLS_CC);
                                                                    ^~~~~~~~~~
                                                                    )

/tmp/ext-src/trunk/svn.c:3476:17: warning: assignment to 'apr_array_header_t *' {aka 'struct apr_array_header_t *'} from 'int' makes pointer from integer without a cast [-Wint-conversion]
   targets_array = replicate_zend_hash_to_apr_array(targets, subpool TSRMLS_CC);
                 ^

/tmp/ext-src/trunk/svn.c:3479:2: warning: 'svn_client_commit3' is deprecated [-Wdeprecated-declarations]
  err = svn_client_commit3(&info, targets_array, recursive, 1, SVN_G(ctx), subpool);
  ^~~

In file included from /tmp/ext-src/trunk/php_svn.h:43,
                 from /tmp/ext-src/trunk/svn.c:33:
/usr/include/subversion-1/svn_client.h:2246:1: note: declared here
 svn_client_commit3(svn_commit_info_t **commit_info_p,
 ^~~~~~~~~~~~~~~~~~

/tmp/ext-src/trunk/svn.c:3483:27: error: expected ')' before 'TSRMLS_CC'
   php_svn_handle_error(err TSRMLS_CC);
                           ^~~~~~~~~~
                           )

/tmp/ext-src/trunk/svn.c:3500:25: error: expected ')' before 'TSRMLS_CC'
   php_error_docref(NULL TSRMLS_CC, E_WARNING, "commit didn't return any info");
                         ^~~~~~~~~

/tmp/ext-src/trunk/svn.c:3500:3: error: too few arguments to function 'php_error_docref'
   php_error_docref(NULL TSRMLS_CC, E_WARNING, "commit didn't return any info");
   ^~~~~~~~~~~~~~~~

In file included from /tmp/ext-src/trunk/svn.c:30:
/usr/local/include/php/main/php.h:341:23: note: declared here
 PHPAPI ZEND_COLD void php_error_docref(const char *docref, int type, const char *format, ...)
                       ^~~~~~~~~~~~~~~~

/tmp/ext-src/trunk/svn.c: In function 'zif_svn_lock':

/tmp/ext-src/trunk/svn.c:3524:83: error: expected ')' before 'TSRMLS_CC'
  if (FAILURE == zend_parse_parameters_ex(ZEND_PARSE_PARAMS_QUIET, ZEND_NUM_ARGS() TSRMLS_CC, "ss|b",
                                                                                   ^~~~~~~~~

/tmp/ext-src/trunk/svn.c:3524:17: error: too few arguments to function 'zend_parse_parameters_ex'
  if (FAILURE == zend_parse_parameters_ex(ZEND_PARSE_PARAMS_QUIET, ZEND_NUM_ARGS() TSRMLS_CC, "ss|b",
                 ^~~~~~~~~~~~~~~~~~~~~~~~

In file included from /usr/local/include/php/main/php.h:35,
                 from /tmp/ext-src/trunk/svn.c:30:
/usr/local/include/php/Zend/zend_API.h:305:22: note: declared here
 ZEND_API zend_result zend_parse_parameters_ex(int flags, uint32_t num_args, const char *type_spec, ...);
                      ^~~~~~~~~~~~~~~~~~~~~~~~

/tmp/ext-src/trunk/svn.c:3526:56: error: expected ')' before 'TSRMLS_CC'
   if (FAILURE == zend_parse_parameters(ZEND_NUM_ARGS() TSRMLS_CC, "sa|b",
                                                        ^~~~~~~~~

/tmp/ext-src/trunk/svn.c:3526:18: error: too few arguments to function 'zend_parse_parameters'
   if (FAILURE == zend_parse_parameters(ZEND_NUM_ARGS() TSRMLS_CC, "sa|b",
                  ^~~~~~~~~~~~~~~~~~~~~

In file included from /usr/local/include/php/main/php.h:35,
                 from /tmp/ext-src/trunk/svn.c:30:
/usr/local/include/php/Zend/zend_API.h:304:22: note: declared here
 ZEND_API zend_result zend_parse_parameters(uint32_t num_args, const char *type_spec, ...);
                      ^~~~~~~~~~~~~~~~~~~~~

/tmp/ext-src/trunk/svn.c:55:23: error: 'TSRMLS_C' undeclared (first use in this function); did you mean 'TSRM_H'?
   if (init_svn_client(TSRMLS_C)) RETURN_FALSE; \
                       ^~~~~~~~
/tmp/ext-src/trunk/svn.c:3532:2: note: in expansion of macro 'PHP_SVN_INIT_CLIENT'
  PHP_SVN_INIT_CLIENT();
  ^~~~~~~~~~~~~~~~~~~

/tmp/ext-src/trunk/svn.c:3541:28: error: expected ')' before 'TSRMLS_CC'
    php_svn_handle_error(err TSRMLS_CC);
                            ^~~~~~~~~~
                            )

/tmp/ext-src/trunk/svn.c:3545:3: warning: 'svn_path_canonicalize' is deprecated [-Wdeprecated-declarations]
   path = svn_path_canonicalize(utf8_path, subpool);
   ^~~~

In file included from /tmp/ext-src/trunk/svn.c:40:
/usr/include/subversion-1/svn_path.h:284:1: note: declared here
 svn_path_canonicalize(const char *path, apr_pool_t *pool);
 ^~~~~~~~~~~~~~~~~~~~~

/tmp/ext-src/trunk/svn.c:3551:68: error: expected ')' before 'TSRMLS_CC'
   targets_array = replicate_zend_hash_to_apr_array(targets, subpool TSRMLS_CC);
                                                                    ^~~~~~~~~~
                                                                    )

/tmp/ext-src/trunk/svn.c:3551:17: warning: assignment to 'apr_array_header_t *' {aka 'struct apr_array_header_t *'} from 'int' makes pointer from integer without a cast [-Wint-conversion]
   targets_array = replicate_zend_hash_to_apr_array(targets, subpool TSRMLS_CC);
                 ^

/tmp/ext-src/trunk/svn.c:3557:27: error: expected ')' before 'TSRMLS_CC'
   php_svn_handle_error(err TSRMLS_CC);
                           ^~~~~~~~~~
                           )

/tmp/ext-src/trunk/svn.c: In function 'zif_svn_unlock':

/tmp/ext-src/trunk/svn.c:3582:83: error: expected ')' before 'TSRMLS_CC'
  if (FAILURE == zend_parse_parameters_ex(ZEND_PARSE_PARAMS_QUIET, ZEND_NUM_ARGS() TSRMLS_CC, "s|b",
                                                                                   ^~~~~~~~~

/tmp/ext-src/trunk/svn.c:3582:17: error: too few arguments to function 'zend_parse_parameters_ex'
  if (FAILURE == zend_parse_parameters_ex(ZEND_PARSE_PARAMS_QUIET, ZEND_NUM_ARGS() TSRMLS_CC, "s|b",
                 ^~~~~~~~~~~~~~~~~~~~~~~~

In file included from /usr/local/include/php/main/php.h:35,
                 from /tmp/ext-src/trunk/svn.c:30:
/usr/local/include/php/Zend/zend_API.h:305:22: note: declared here
 ZEND_API zend_result zend_parse_parameters_ex(int flags, uint32_t num_args, const char *type_spec, ...);
                      ^~~~~~~~~~~~~~~~~~~~~~~~

/tmp/ext-src/trunk/svn.c:3584:56: error: expected ')' before 'TSRMLS_CC'
   if (FAILURE == zend_parse_parameters(ZEND_NUM_ARGS() TSRMLS_CC, "a|b",
                                                        ^~~~~~~~~

/tmp/ext-src/trunk/svn.c:3584:18: error: too few arguments to function 'zend_parse_parameters'
   if (FAILURE == zend_parse_parameters(ZEND_NUM_ARGS() TSRMLS_CC, "a|b",
                  ^~~~~~~~~~~~~~~~~~~~~

In file included from /usr/local/include/php/main/php.h:35,
                 from /tmp/ext-src/trunk/svn.c:30:
/usr/local/include/php/Zend/zend_API.h:304:22: note: declared here
 ZEND_API zend_result zend_parse_parameters(uint32_t num_args, const char *type_spec, ...);
                      ^~~~~~~~~~~~~~~~~~~~~

/tmp/ext-src/trunk/svn.c:55:23: error: 'TSRMLS_C' undeclared (first use in this function); did you mean 'TSRM_H'?
   if (init_svn_client(TSRMLS_C)) RETURN_FALSE; \
                       ^~~~~~~~
/tmp/ext-src/trunk/svn.c:3590:2: note: in expansion of macro 'PHP_SVN_INIT_CLIENT'
  PHP_SVN_INIT_CLIENT();
  ^~~~~~~~~~~~~~~~~~~

/tmp/ext-src/trunk/svn.c:3599:28: error: expected ')' before 'TSRMLS_CC'
    php_svn_handle_error(err TSRMLS_CC);
                            ^~~~~~~~~~
                            )

/tmp/ext-src/trunk/svn.c:3603:3: warning: 'svn_path_canonicalize' is deprecated [-Wdeprecated-declarations]
   path = svn_path_canonicalize(utf8_path, subpool);
   ^~~~

In file included from /tmp/ext-src/trunk/svn.c:40:
/usr/include/subversion-1/svn_path.h:284:1: note: declared here
 svn_path_canonicalize(const char *path, apr_pool_t *pool);
 ^~~~~~~~~~~~~~~~~~~~~

/tmp/ext-src/trunk/svn.c:3609:68: error: expected ')' before 'TSRMLS_CC'
   targets_array = replicate_zend_hash_to_apr_array(targets, subpool TSRMLS_CC);
                                                                    ^~~~~~~~~~
                                                                    )

/tmp/ext-src/trunk/svn.c:3609:17: warning: assignment to 'apr_array_header_t *' {aka 'struct apr_array_header_t *'} from 'int' makes pointer from integer without a cast [-Wint-conversion]
   targets_array = replicate_zend_hash_to_apr_array(targets, subpool TSRMLS_CC);
                 ^

/tmp/ext-src/trunk/svn.c:3615:27: error: expected ')' before 'TSRMLS_CC'
   php_svn_handle_error(err TSRMLS_CC);
                           ^~~~~~~~~~
                           )

/tmp/ext-src/trunk/svn.c: In function 'zif_svn_add':

/tmp/ext-src/trunk/svn.c:3638:55: error: expected ')' before 'TSRMLS_CC'
  if (FAILURE == zend_parse_parameters(ZEND_NUM_ARGS() TSRMLS_CC, "s|bb",
                                                       ^~~~~~~~~

/tmp/ext-src/trunk/svn.c:3638:17: error: too few arguments to function 'zend_parse_parameters'
  if (FAILURE == zend_parse_parameters(ZEND_NUM_ARGS() TSRMLS_CC, "s|bb",
                 ^~~~~~~~~~~~~~~~~~~~~

In file included from /usr/local/include/php/main/php.h:35,
                 from /tmp/ext-src/trunk/svn.c:30:
/usr/local/include/php/Zend/zend_API.h:304:22: note: declared here
 ZEND_API zend_result zend_parse_parameters(uint32_t num_args, const char *type_spec, ...);
                      ^~~~~~~~~~~~~~~~~~~~~

/tmp/ext-src/trunk/svn.c:55:23: error: 'TSRMLS_C' undeclared (first use in this function); did you mean 'TSRM_H'?
   if (init_svn_client(TSRMLS_C)) RETURN_FALSE; \
                       ^~~~~~~~
/tmp/ext-src/trunk/svn.c:3643:2: note: in expansion of macro 'PHP_SVN_INIT_CLIENT'
  PHP_SVN_INIT_CLIENT();
  ^~~~~~~~~~~~~~~~~~~

/tmp/ext-src/trunk/svn.c:3651:27: error: expected ')' before 'TSRMLS_CC'
   php_svn_handle_error(err TSRMLS_CC);
                           ^~~~~~~~~~
                           )

/tmp/ext-src/trunk/svn.c:3656:2: warning: 'svn_path_canonicalize' is deprecated [-Wdeprecated-declarations]
  path = svn_path_canonicalize(utf8_path, subpool);
  ^~~~

In file included from /tmp/ext-src/trunk/svn.c:40:
/usr/include/subversion-1/svn_path.h:284:1: note: declared here
 svn_path_canonicalize(const char *path, apr_pool_t *pool);
 ^~~~~~~~~~~~~~~~~~~~~

/tmp/ext-src/trunk/svn.c:3658:2: warning: 'svn_client_add2' is deprecated [-Wdeprecated-declarations]
  err = svn_client_add2((const char*)path, recurse, force, SVN_G(ctx), subpool);
  ^~~

In file included from /tmp/ext-src/trunk/php_svn.h:43,
                 from /tmp/ext-src/trunk/svn.c:33:
/usr/include/subversion-1/svn_client.h:1659:1: note: declared here
 svn_client_add2(const char *path,
 ^~~~~~~~~~~~~~~

/tmp/ext-src/trunk/svn.c:3661:27: error: expected ')' before 'TSRMLS_CC'
   php_svn_handle_error(err TSRMLS_CC);
                           ^~~~~~~~~~
                           )

/tmp/ext-src/trunk/svn.c: In function 'zif_svn_status':

/tmp/ext-src/trunk/svn.c:3745:55: error: expected ')' before 'TSRMLS_CC'
  if (FAILURE == zend_parse_parameters(ZEND_NUM_ARGS() TSRMLS_CC, "s|l",
                                                       ^~~~~~~~~

/tmp/ext-src/trunk/svn.c:3745:17: error: too few arguments to function 'zend_parse_parameters'
  if (FAILURE == zend_parse_parameters(ZEND_NUM_ARGS() TSRMLS_CC, "s|l",
                 ^~~~~~~~~~~~~~~~~~~~~

In file included from /usr/local/include/php/main/php.h:35,
                 from /tmp/ext-src/trunk/svn.c:30:
/usr/local/include/php/Zend/zend_API.h:304:22: note: declared here
 ZEND_API zend_result zend_parse_parameters(uint32_t num_args, const char *type_spec, ...);
                      ^~~~~~~~~~~~~~~~~~~~~

/tmp/ext-src/trunk/svn.c:55:23: error: 'TSRMLS_C' undeclared (first use in this function); did you mean 'TSRM_H'?
   if (init_svn_client(TSRMLS_C)) RETURN_FALSE; \
                       ^~~~~~~~
/tmp/ext-src/trunk/svn.c:3750:2: note: in expansion of macro 'PHP_SVN_INIT_CLIENT'
  PHP_SVN_INIT_CLIENT();
  ^~~~~~~~~~~~~~~~~~~

/tmp/ext-src/trunk/svn.c:3758:27: error: expected ')' before 'TSRMLS_CC'
   php_svn_handle_error(err TSRMLS_CC);
                           ^~~~~~~~~~
                           )

/tmp/ext-src/trunk/svn.c:3762:2: warning: 'svn_path_canonicalize' is deprecated [-Wdeprecated-declarations]
  path = svn_path_canonicalize(utf8_path, subpool);
  ^~~~

In file included from /tmp/ext-src/trunk/svn.c:40:
/usr/include/subversion-1/svn_path.h:284:1: note: declared here
 svn_path_canonicalize(const char *path, apr_pool_t *pool);
 ^~~~~~~~~~~~~~~~~~~~~

/tmp/ext-src/trunk/svn.c:3767:2: warning: 'svn_client_status2' is deprecated [-Wdeprecated-declarations]
  err = svn_client_status2(
  ^~~

In file included from /tmp/ext-src/trunk/php_svn.h:43,
                 from /tmp/ext-src/trunk/svn.c:33:
/usr/include/subversion-1/svn_client.h:2654:1: note: declared here
 svn_client_status2(svn_revnum_t *result_rev,
 ^~~~~~~~~~~~~~~~~~

/tmp/ext-src/trunk/svn.c:3782:27: error: expected ')' before 'TSRMLS_CC'
   php_svn_handle_error(err TSRMLS_CC);
                           ^~~~~~~~~~
                           )

/tmp/ext-src/trunk/svn.c: In function 'zif_svn_update':

/tmp/ext-src/trunk/svn.c:3806:55: error: expected ')' before 'TSRMLS_CC'
  if (FAILURE == zend_parse_parameters(ZEND_NUM_ARGS() TSRMLS_CC, "s|lb",
                                                       ^~~~~~~~~

/tmp/ext-src/trunk/svn.c:3806:17: error: too few arguments to function 'zend_parse_parameters'
  if (FAILURE == zend_parse_parameters(ZEND_NUM_ARGS() TSRMLS_CC, "s|lb",
                 ^~~~~~~~~~~~~~~~~~~~~

In file included from /usr/local/include/php/main/php.h:35,
                 from /tmp/ext-src/trunk/svn.c:30:
/usr/local/include/php/Zend/zend_API.h:304:22: note: declared here
 ZEND_API zend_result zend_parse_parameters(uint32_t num_args, const char *type_spec, ...);
                      ^~~~~~~~~~~~~~~~~~~~~

/tmp/ext-src/trunk/svn.c:55:23: error: 'TSRMLS_C' undeclared (first use in this function); did you mean 'TSRM_H'?
   if (init_svn_client(TSRMLS_C)) RETURN_FALSE; \
                       ^~~~~~~~
/tmp/ext-src/trunk/svn.c:3811:2: note: in expansion of macro 'PHP_SVN_INIT_CLIENT'
  PHP_SVN_INIT_CLIENT();
  ^~~~~~~~~~~~~~~~~~~

/tmp/ext-src/trunk/svn.c:3820:27: error: expected ')' before 'TSRMLS_CC'
   php_svn_handle_error(err TSRMLS_CC);
                           ^~~~~~~~~~
                           )

/tmp/ext-src/trunk/svn.c:3825:2: warning: 'svn_path_canonicalize' is deprecated [-Wdeprecated-declarations]
  path = svn_path_canonicalize(utf8_path, subpool);
  ^~~~

In file included from /tmp/ext-src/trunk/svn.c:40:
/usr/include/subversion-1/svn_path.h:284:1: note: declared here
 svn_path_canonicalize(const char *path, apr_pool_t *pool);
 ^~~~~~~~~~~~~~~~~~~~~

/tmp/ext-src/trunk/svn.c:3830:2: warning: 'svn_client_update' is deprecated [-Wdeprecated-declarations]
  err = svn_client_update(&result_rev, path, &rev, recurse,
  ^~~

In file included from /tmp/ext-src/trunk/php_svn.h:43,
                 from /tmp/ext-src/trunk/svn.c:33:
/usr/include/subversion-1/svn_client.h:1415:1: note: declared here
 svn_client_update(svn_revnum_t *result_rev,
 ^~~~~~~~~~~~~~~~~

/tmp/ext-src/trunk/svn.c:3834:27: error: expected ')' before 'TSRMLS_CC'
   php_svn_handle_error(err TSRMLS_CC);
                           ^~~~~~~~~~
                           )

/tmp/ext-src/trunk/svn.c: In function 'zif_svn_update2':

/tmp/ext-src/trunk/svn.c:3865:55: error: expected ')' before 'TSRMLS_CC'
  if (FAILURE == zend_parse_parameters(ZEND_NUM_ARGS() TSRMLS_CC, "s|lll",
                                                       ^~~~~~~~~

/tmp/ext-src/trunk/svn.c:3865:17: error: too few arguments to function 'zend_parse_parameters'
  if (FAILURE == zend_parse_parameters(ZEND_NUM_ARGS() TSRMLS_CC, "s|lll",
                 ^~~~~~~~~~~~~~~~~~~~~

In file included from /usr/local/include/php/main/php.h:35,
                 from /tmp/ext-src/trunk/svn.c:30:
/usr/local/include/php/Zend/zend_API.h:304:22: note: declared here
 ZEND_API zend_result zend_parse_parameters(uint32_t num_args, const char *type_spec, ...);
                      ^~~~~~~~~~~~~~~~~~~~~

/tmp/ext-src/trunk/svn.c:55:23: error: 'TSRMLS_C' undeclared (first use in this function); did you mean 'TSRM_H'?
   if (init_svn_client(TSRMLS_C)) RETURN_FALSE; \
                       ^~~~~~~~
/tmp/ext-src/trunk/svn.c:3870:2: note: in expansion of macro 'PHP_SVN_INIT_CLIENT'
  PHP_SVN_INIT_CLIENT();
  ^~~~~~~~~~~~~~~~~~~

/tmp/ext-src/trunk/svn.c:3879:27: error: expected ')' before 'TSRMLS_CC'
   php_svn_handle_error(err TSRMLS_CC);
                           ^~~~~~~~~~
                           )

/tmp/ext-src/trunk/svn.c:3884:2: warning: 'svn_path_canonicalize' is deprecated [-Wdeprecated-declarations]
  path = svn_path_canonicalize(utf8_path, subpool);
  ^~~~

In file included from /tmp/ext-src/trunk/svn.c:40:
/usr/include/subversion-1/svn_path.h:284:1: note: declared here
 svn_path_canonicalize(const char *path, apr_pool_t *pool);
 ^~~~~~~~~~~~~~~~~~~~~

/tmp/ext-src/trunk/svn.c:3892:2: warning: 'svn_client_update3' is deprecated [-Wdeprecated-declarations]
  err = svn_client_update3(
  ^~~

In file included from /tmp/ext-src/trunk/php_svn.h:43,
                 from /tmp/ext-src/trunk/svn.c:33:
/usr/include/subversion-1/svn_client.h:1377:1: note: declared here
 svn_client_update3(apr_array_header_t **result_revs,
 ^~~~~~~~~~~~~~~~~~

/tmp/ext-src/trunk/svn.c:3901:27: error: expected ')' before 'TSRMLS_CC'
   php_svn_handle_error(err TSRMLS_CC);
                           ^~~~~~~~~~
                           )

/tmp/ext-src/trunk/svn.c: In function 'zif_svn_repos_fs_begin_txn_for_commit':

/tmp/ext-src/trunk/svn.c:3956:55: error: expected ')' before 'TSRMLS_CC'
  if (FAILURE == zend_parse_parameters(ZEND_NUM_ARGS() TSRMLS_CC, "rlss",
                                                       ^~~~~~~~~

/tmp/ext-src/trunk/svn.c:3956:17: error: too few arguments to function 'zend_parse_parameters'
  if (FAILURE == zend_parse_parameters(ZEND_NUM_ARGS() TSRMLS_CC, "rlss",
                 ^~~~~~~~~~~~~~~~~~~~~

In file included from /usr/local/include/php/main/php.h:35,
                 from /tmp/ext-src/trunk/svn.c:30:
/usr/local/include/php/Zend/zend_API.h:304:22: note: declared here
 ZEND_API zend_result zend_parse_parameters(uint32_t num_args, const char *type_spec, ...);
                      ^~~~~~~~~~~~~~~~~~~~~

/tmp/ext-src/trunk/svn.c:3968:2: warning: 'svn_repos_fs_begin_txn_for_commit' is deprecated [-Wdeprecated-declarations]
  err = svn_repos_fs_begin_txn_for_commit(&txn_p, repos->repos, rev, author, log_msg, subpool);
  ^~~

In file included from /tmp/ext-src/trunk/svn.c:42:
/usr/include/subversion-1/svn_repos.h:2534:1: note: declared here
 svn_repos_fs_begin_txn_for_commit(svn_fs_txn_t **txn_p,
 ^~~~~~~~~~~~~~~~~~~~~~~~~~~~~~~~~

/tmp/ext-src/trunk/svn.c:3971:27: error: expected ')' before 'TSRMLS_CC'
   php_svn_handle_error(err TSRMLS_CC);
                           ^~~~~~~~~~
                           )

/tmp/ext-src/trunk/svn.c: In function 'zif_svn_repos_fs_commit_txn':

/tmp/ext-src/trunk/svn.c:3999:55: error: expected ')' before 'TSRMLS_CC'
  if (FAILURE == zend_parse_parameters(ZEND_NUM_ARGS() TSRMLS_CC, "r",
                                                       ^~~~~~~~~

/tmp/ext-src/trunk/svn.c:3999:17: error: too few arguments to function 'zend_parse_parameters'
  if (FAILURE == zend_parse_parameters(ZEND_NUM_ARGS() TSRMLS_CC, "r",
                 ^~~~~~~~~~~~~~~~~~~~~

In file included from /usr/local/include/php/main/php.h:35,
                 from /tmp/ext-src/trunk/svn.c:30:
/usr/local/include/php/Zend/zend_API.h:304:22: note: declared here
 ZEND_API zend_result zend_parse_parameters(uint32_t num_args, const char *type_spec, ...);
                      ^~~~~~~~~~~~~~~~~~~~~

/tmp/ext-src/trunk/svn.c:4009:27: error: expected ')' before 'TSRMLS_CC'
   php_svn_handle_error(err TSRMLS_CC);
                           ^~~~~~~~~~
                           )

/tmp/ext-src/trunk/svn.c: In function 'zif_svn_fs_txn_root':

/tmp/ext-src/trunk/svn.c:4028:55: error: expected ')' before 'TSRMLS_CC'
  if (FAILURE == zend_parse_parameters(ZEND_NUM_ARGS() TSRMLS_CC, "r",
                                                       ^~~~~~~~~

/tmp/ext-src/trunk/svn.c:4028:17: error: too few arguments to function 'zend_parse_parameters'
  if (FAILURE == zend_parse_parameters(ZEND_NUM_ARGS() TSRMLS_CC, "r",
                 ^~~~~~~~~~~~~~~~~~~~~

In file included from /usr/local/include/php/main/php.h:35,
                 from /tmp/ext-src/trunk/svn.c:30:
/usr/local/include/php/Zend/zend_API.h:304:22: note: declared here
 ZEND_API zend_result zend_parse_parameters(uint32_t num_args, const char *type_spec, ...);
                      ^~~~~~~~~~~~~~~~~~~~~

/tmp/ext-src/trunk/svn.c:4038:27: error: expected ')' before 'TSRMLS_CC'
   php_svn_handle_error(err TSRMLS_CC);
                           ^~~~~~~~~~
                           )

/tmp/ext-src/trunk/svn.c: In function 'zif_svn_fs_make_file':

/tmp/ext-src/trunk/svn.c:4067:55: error: expected ')' before 'TSRMLS_CC'
  if (FAILURE == zend_parse_parameters(ZEND_NUM_ARGS() TSRMLS_CC, "rs",
                                                       ^~~~~~~~~

/tmp/ext-src/trunk/svn.c:4067:17: error: too few arguments to function 'zend_parse_parameters'
  if (FAILURE == zend_parse_parameters(ZEND_NUM_ARGS() TSRMLS_CC, "rs",
                 ^~~~~~~~~~~~~~~~~~~~~

In file included from /usr/local/include/php/main/php.h:35,
                 from /tmp/ext-src/trunk/svn.c:30:
/usr/local/include/php/Zend/zend_API.h:304:22: note: declared here
 ZEND_API zend_result zend_parse_parameters(uint32_t num_args, const char *type_spec, ...);
                      ^~~~~~~~~~~~~~~~~~~~~

/tmp/ext-src/trunk/svn.c:4079:27: error: expected ')' before 'TSRMLS_CC'
   php_svn_handle_error(err TSRMLS_CC);
                           ^~~~~~~~~~
                           )

/tmp/ext-src/trunk/svn.c:4083:2: warning: 'svn_path_canonicalize' is deprecated [-Wdeprecated-declarations]
  path = svn_path_canonicalize(utf8_path, subpool);
  ^~~~

In file included from /tmp/ext-src/trunk/svn.c:40:
/usr/include/subversion-1/svn_path.h:284:1: note: declared here
 svn_path_canonicalize(const char *path, apr_pool_t *pool);
 ^~~~~~~~~~~~~~~~~~~~~

/tmp/ext-src/trunk/svn.c:4090:27: error: expected ')' before 'TSRMLS_CC'
   php_svn_handle_error(err TSRMLS_CC);
                           ^~~~~~~~~~
                           )

/tmp/ext-src/trunk/svn.c: In function 'zif_svn_fs_make_dir':

/tmp/ext-src/trunk/svn.c:4112:55: error: expected ')' before 'TSRMLS_CC'
  if (FAILURE == zend_parse_parameters(ZEND_NUM_ARGS() TSRMLS_CC, "rs",
                                                       ^~~~~~~~~

/tmp/ext-src/trunk/svn.c:4112:17: error: too few arguments to function 'zend_parse_parameters'
  if (FAILURE == zend_parse_parameters(ZEND_NUM_ARGS() TSRMLS_CC, "rs",
                 ^~~~~~~~~~~~~~~~~~~~~

In file included from /usr/local/include/php/main/php.h:35,
                 from /tmp/ext-src/trunk/svn.c:30:
/usr/local/include/php/Zend/zend_API.h:304:22: note: declared here
 ZEND_API zend_result zend_parse_parameters(uint32_t num_args, const char *type_spec, ...);
                      ^~~~~~~~~~~~~~~~~~~~~

/tmp/ext-src/trunk/svn.c:4124:27: error: expected ')' before 'TSRMLS_CC'
   php_svn_handle_error(err TSRMLS_CC);
                           ^~~~~~~~~~
                           )

/tmp/ext-src/trunk/svn.c:4128:2: warning: 'svn_path_canonicalize' is deprecated [-Wdeprecated-declarations]
  path = svn_path_canonicalize(utf8_path, subpool);
  ^~~~

In file included from /tmp/ext-src/trunk/svn.c:40:
/usr/include/subversion-1/svn_path.h:284:1: note: declared here
 svn_path_canonicalize(const char *path, apr_pool_t *pool);
 ^~~~~~~~~~~~~~~~~~~~~

/tmp/ext-src/trunk/svn.c:4135:27: error: expected ')' before 'TSRMLS_CC'
   php_svn_handle_error(err TSRMLS_CC);
                           ^~~~~~~~~~
                           )

/tmp/ext-src/trunk/svn.c: In function 'zif_svn_fs_apply_text':

/tmp/ext-src/trunk/svn.c:4160:55: error: expected ')' before 'TSRMLS_CC'
  if (FAILURE == zend_parse_parameters(ZEND_NUM_ARGS() TSRMLS_CC, "rs",
                                                       ^~~~~~~~~

/tmp/ext-src/trunk/svn.c:4160:17: error: too few arguments to function 'zend_parse_parameters'
  if (FAILURE == zend_parse_parameters(ZEND_NUM_ARGS() TSRMLS_CC, "rs",
                 ^~~~~~~~~~~~~~~~~~~~~

In file included from /usr/local/include/php/main/php.h:35,
                 from /tmp/ext-src/trunk/svn.c:30:
/usr/local/include/php/Zend/zend_API.h:304:22: note: declared here
 ZEND_API zend_result zend_parse_parameters(uint32_t num_args, const char *type_spec, ...);
                      ^~~~~~~~~~~~~~~~~~~~~

/tmp/ext-src/trunk/svn.c:4172:27: error: expected ')' before 'TSRMLS_CC'
   php_svn_handle_error(err TSRMLS_CC);
                           ^~~~~~~~~~
                           )

/tmp/ext-src/trunk/svn.c:4176:2: warning: 'svn_path_canonicalize' is deprecated [-Wdeprecated-declarations]
  path = svn_path_canonicalize(utf8_path, subpool);
  ^~~~

In file included from /tmp/ext-src/trunk/svn.c:40:
/usr/include/subversion-1/svn_path.h:284:1: note: declared here
 svn_path_canonicalize(const char *path, apr_pool_t *pool);
 ^~~~~~~~~~~~~~~~~~~~~

/tmp/ext-src/trunk/svn.c:4183:27: error: expected ')' before 'TSRMLS_CC'
   php_svn_handle_error(err TSRMLS_CC);
                           ^~~~~~~~~~
                           )

/tmp/ext-src/trunk/svn.c: In function 'zif_svn_fs_copy':

/tmp/ext-src/trunk/svn.c:4213:55: error: expected ')' before 'TSRMLS_CC'
  if (FAILURE == zend_parse_parameters(ZEND_NUM_ARGS() TSRMLS_CC, "rsrs",
                                                       ^~~~~~~~~

/tmp/ext-src/trunk/svn.c:4213:17: error: too few arguments to function 'zend_parse_parameters'
  if (FAILURE == zend_parse_parameters(ZEND_NUM_ARGS() TSRMLS_CC, "rsrs",
                 ^~~~~~~~~~~~~~~~~~~~~

In file included from /usr/local/include/php/main/php.h:35,
                 from /tmp/ext-src/trunk/svn.c:30:
/usr/local/include/php/Zend/zend_API.h:304:22: note: declared here
 ZEND_API zend_result zend_parse_parameters(uint32_t num_args, const char *type_spec, ...);
                      ^~~~~~~~~~~~~~~~~~~~~

/tmp/ext-src/trunk/svn.c:4226:27: error: expected ')' before 'TSRMLS_CC'
   php_svn_handle_error(err TSRMLS_CC);
                           ^~~~~~~~~~
                           )

/tmp/ext-src/trunk/svn.c:4232:27: error: expected ')' before 'TSRMLS_CC'
   php_svn_handle_error(err TSRMLS_CC);
                           ^~~~~~~~~~
                           )

/tmp/ext-src/trunk/svn.c:4237:2: warning: 'svn_path_canonicalize' is deprecated [-Wdeprecated-declarations]
  from_path = svn_path_canonicalize(utf8_from_path, subpool);
  ^~~~~~~~~

In file included from /tmp/ext-src/trunk/svn.c:40:
/usr/include/subversion-1/svn_path.h:284:1: note: declared here
 svn_path_canonicalize(const char *path, apr_pool_t *pool);
 ^~~~~~~~~~~~~~~~~~~~~

/tmp/ext-src/trunk/svn.c:4238:2: warning: 'svn_path_canonicalize' is deprecated [-Wdeprecated-declarations]
  to_path = svn_path_canonicalize(utf8_to_path, subpool);
  ^~~~~~~

In file included from /tmp/ext-src/trunk/svn.c:40:
/usr/include/subversion-1/svn_path.h:284:1: note: declared here
 svn_path_canonicalize(const char *path, apr_pool_t *pool);
 ^~~~~~~~~~~~~~~~~~~~~

/tmp/ext-src/trunk/svn.c:4246:27: error: expected ')' before 'TSRMLS_CC'
   php_svn_handle_error(err TSRMLS_CC);
                           ^~~~~~~~~~
                           )

/tmp/ext-src/trunk/svn.c: In function 'zif_svn_fs_delete':

/tmp/ext-src/trunk/svn.c:4268:55: error: expected ')' before 'TSRMLS_CC'
  if (FAILURE == zend_parse_parameters(ZEND_NUM_ARGS() TSRMLS_CC, "rs",
                                                       ^~~~~~~~~

/tmp/ext-src/trunk/svn.c:4268:17: error: too few arguments to function 'zend_parse_parameters'
  if (FAILURE == zend_parse_parameters(ZEND_NUM_ARGS() TSRMLS_CC, "rs",
                 ^~~~~~~~~~~~~~~~~~~~~

In file included from /usr/local/include/php/main/php.h:35,
                 from /tmp/ext-src/trunk/svn.c:30:
/usr/local/include/php/Zend/zend_API.h:304:22: note: declared here
 ZEND_API zend_result zend_parse_parameters(uint32_t num_args, const char *type_spec, ...);
                      ^~~~~~~~~~~~~~~~~~~~~

/tmp/ext-src/trunk/svn.c:4280:27: error: expected ')' before 'TSRMLS_CC'
   php_svn_handle_error(err TSRMLS_CC);
                           ^~~~~~~~~~
                           )

/tmp/ext-src/trunk/svn.c:4284:2: warning: 'svn_path_canonicalize' is deprecated [-Wdeprecated-declarations]
  path = svn_path_canonicalize(utf8_path, subpool);
  ^~~~

In file included from /tmp/ext-src/trunk/svn.c:40:
/usr/include/subversion-1/svn_path.h:284:1: note: declared here
 svn_path_canonicalize(const char *path, apr_pool_t *pool);
 ^~~~~~~~~~~~~~~~~~~~~

/tmp/ext-src/trunk/svn.c:4291:27: error: expected ')' before 'TSRMLS_CC'
   php_svn_handle_error(err TSRMLS_CC);
                           ^~~~~~~~~~
                           )

/tmp/ext-src/trunk/svn.c: In function 'zif_svn_fs_begin_txn2':

/tmp/ext-src/trunk/svn.c:4314:55: error: expected ')' before 'TSRMLS_CC'
  if (FAILURE == zend_parse_parameters(ZEND_NUM_ARGS() TSRMLS_CC, "rl",
                                                       ^~~~~~~~~

/tmp/ext-src/trunk/svn.c:4314:17: error: too few arguments to function 'zend_parse_parameters'
  if (FAILURE == zend_parse_parameters(ZEND_NUM_ARGS() TSRMLS_CC, "rl",
                 ^~~~~~~~~~~~~~~~~~~~~

In file included from /usr/local/include/php/main/php.h:35,
                 from /tmp/ext-src/trunk/svn.c:30:
/usr/local/include/php/Zend/zend_API.h:304:22: note: declared here
 ZEND_API zend_result zend_parse_parameters(uint32_t num_args, const char *type_spec, ...);
                      ^~~~~~~~~~~~~~~~~~~~~

/tmp/ext-src/trunk/svn.c:4324:27: error: expected ')' before 'TSRMLS_CC'
   php_svn_handle_error(err TSRMLS_CC);
                           ^~~~~~~~~~
                           )

/tmp/ext-src/trunk/svn.c: In function 'zif_svn_fs_is_file':

/tmp/ext-src/trunk/svn.c:4354:55: error: expected ')' before 'TSRMLS_CC'
  if (FAILURE == zend_parse_parameters(ZEND_NUM_ARGS() TSRMLS_CC, "rs",
                                                       ^~~~~~~~~

/tmp/ext-src/trunk/svn.c:4354:17: error: too few arguments to function 'zend_parse_parameters'
  if (FAILURE == zend_parse_parameters(ZEND_NUM_ARGS() TSRMLS_CC, "rs",
                 ^~~~~~~~~~~~~~~~~~~~~

In file included from /usr/local/include/php/main/php.h:35,
                 from /tmp/ext-src/trunk/svn.c:30:
/usr/local/include/php/Zend/zend_API.h:304:22: note: declared here
 ZEND_API zend_result zend_parse_parameters(uint32_t num_args, const char *type_spec, ...);
                      ^~~~~~~~~~~~~~~~~~~~~

/tmp/ext-src/trunk/svn.c:4366:27: error: expected ')' before 'TSRMLS_CC'
   php_svn_handle_error(err TSRMLS_CC);
                           ^~~~~~~~~~
                           )

/tmp/ext-src/trunk/svn.c:4371:2: warning: 'svn_path_canonicalize' is deprecated [-Wdeprecated-declarations]
  path = svn_path_canonicalize(utf8_path, subpool);
  ^~~~

In file included from /tmp/ext-src/trunk/svn.c:40:
/usr/include/subversion-1/svn_path.h:284:1: note: declared here
 svn_path_canonicalize(const char *path, apr_pool_t *pool);
 ^~~~~~~~~~~~~~~~~~~~~

/tmp/ext-src/trunk/svn.c:4378:27: error: expected ')' before 'TSRMLS_CC'
   php_svn_handle_error(err TSRMLS_CC);
                           ^~~~~~~~~~
                           )

/tmp/ext-src/trunk/svn.c: In function 'zif_svn_fs_is_dir':

/tmp/ext-src/trunk/svn.c:4401:55: error: expected ')' before 'TSRMLS_CC'
  if (FAILURE == zend_parse_parameters(ZEND_NUM_ARGS() TSRMLS_CC, "rs",
                                                       ^~~~~~~~~

/tmp/ext-src/trunk/svn.c:4401:17: error: too few arguments to function 'zend_parse_parameters'
  if (FAILURE == zend_parse_parameters(ZEND_NUM_ARGS() TSRMLS_CC, "rs",
                 ^~~~~~~~~~~~~~~~~~~~~

In file included from /usr/local/include/php/main/php.h:35,
                 from /tmp/ext-src/trunk/svn.c:30:
/usr/local/include/php/Zend/zend_API.h:304:22: note: declared here
 ZEND_API zend_result zend_parse_parameters(uint32_t num_args, const char *type_spec, ...);
                      ^~~~~~~~~~~~~~~~~~~~~

/tmp/ext-src/trunk/svn.c:4413:27: error: expected ')' before 'TSRMLS_CC'
   php_svn_handle_error(err TSRMLS_CC);
                           ^~~~~~~~~~
                           )

/tmp/ext-src/trunk/svn.c:4417:2: warning: 'svn_path_canonicalize' is deprecated [-Wdeprecated-declarations]
  path = svn_path_canonicalize(utf8_path, subpool);
  ^~~~

In file included from /tmp/ext-src/trunk/svn.c:40:
/usr/include/subversion-1/svn_path.h:284:1: note: declared here
 svn_path_canonicalize(const char *path, apr_pool_t *pool);
 ^~~~~~~~~~~~~~~~~~~~~

/tmp/ext-src/trunk/svn.c:4424:27: error: expected ')' before 'TSRMLS_CC'
   php_svn_handle_error(err TSRMLS_CC);
                           ^~~~~~~~~~
                           )

/tmp/ext-src/trunk/svn.c: In function 'zif_svn_fs_change_node_prop':

/tmp/ext-src/trunk/svn.c:4448:55: error: expected ')' before 'TSRMLS_CC'
  if (FAILURE == zend_parse_parameters(ZEND_NUM_ARGS() TSRMLS_CC, "rssz",
                                                       ^~~~~~~~~

/tmp/ext-src/trunk/svn.c:4448:17: error: too few arguments to function 'zend_parse_parameters'
  if (FAILURE == zend_parse_parameters(ZEND_NUM_ARGS() TSRMLS_CC, "rssz",
                 ^~~~~~~~~~~~~~~~~~~~~

In file included from /usr/local/include/php/main/php.h:35,
                 from /tmp/ext-src/trunk/svn.c:30:
/usr/local/include/php/Zend/zend_API.h:304:22: note: declared here
 ZEND_API zend_result zend_parse_parameters(uint32_t num_args, const char *type_spec, ...);
                      ^~~~~~~~~~~~~~~~~~~~~

/tmp/ext-src/trunk/svn.c:4460:27: error: expected ')' before 'TSRMLS_CC'
   php_svn_handle_error(err TSRMLS_CC);
                           ^~~~~~~~~~
                           )

/tmp/ext-src/trunk/svn.c:4464:2: warning: 'svn_path_canonicalize' is deprecated [-Wdeprecated-declarations]
  path = svn_path_canonicalize(utf8_path, subpool);
  ^~~~

In file included from /tmp/ext-src/trunk/svn.c:40:
/usr/include/subversion-1/svn_path.h:284:1: note: declared here
 svn_path_canonicalize(const char *path, apr_pool_t *pool);
 ^~~~~~~~~~~~~~~~~~~~~

/tmp/ext-src/trunk/svn.c:4479:27: error: expected ')' before 'TSRMLS_CC'
   php_svn_handle_error(err TSRMLS_CC);
                           ^~~~~~~~~~
                           )

/tmp/ext-src/trunk/svn.c: In function 'zif_svn_fs_contents_changed':

/tmp/ext-src/trunk/svn.c:4503:55: error: expected ')' before 'TSRMLS_CC'
  if (FAILURE == zend_parse_parameters(ZEND_NUM_ARGS() TSRMLS_CC, "rsrs",
                                                       ^~~~~~~~~

/tmp/ext-src/trunk/svn.c:4503:17: error: too few arguments to function 'zend_parse_parameters'
  if (FAILURE == zend_parse_parameters(ZEND_NUM_ARGS() TSRMLS_CC, "rsrs",
                 ^~~~~~~~~~~~~~~~~~~~~

In file included from /usr/local/include/php/main/php.h:35,
                 from /tmp/ext-src/trunk/svn.c:30:
/usr/local/include/php/Zend/zend_API.h:304:22: note: declared here
 ZEND_API zend_result zend_parse_parameters(uint32_t num_args, const char *type_spec, ...);
                      ^~~~~~~~~~~~~~~~~~~~~

/tmp/ext-src/trunk/svn.c:4516:27: error: expected ')' before 'TSRMLS_CC'
   php_svn_handle_error(err TSRMLS_CC);
                           ^~~~~~~~~~
                           )

/tmp/ext-src/trunk/svn.c:4522:27: error: expected ')' before 'TSRMLS_CC'
   php_svn_handle_error(err TSRMLS_CC);
                           ^~~~~~~~~~
                           )

/tmp/ext-src/trunk/svn.c:4527:2: warning: 'svn_path_canonicalize' is deprecated [-Wdeprecated-declarations]
  path1 = svn_path_canonicalize(utf8_path1, subpool);
  ^~~~~

In file included from /tmp/ext-src/trunk/svn.c:40:
/usr/include/subversion-1/svn_path.h:284:1: note: declared here
 svn_path_canonicalize(const char *path, apr_pool_t *pool);
 ^~~~~~~~~~~~~~~~~~~~~

/tmp/ext-src/trunk/svn.c:4528:2: warning: 'svn_path_canonicalize' is deprecated [-Wdeprecated-declarations]
  path2 = svn_path_canonicalize(utf8_path2, subpool);
  ^~~~~

In file included from /tmp/ext-src/trunk/svn.c:40:
/usr/include/subversion-1/svn_path.h:284:1: note: declared here
 svn_path_canonicalize(const char *path, apr_pool_t *pool);
 ^~~~~~~~~~~~~~~~~~~~~

/tmp/ext-src/trunk/svn.c:4537:27: error: expected ')' before 'TSRMLS_CC'
   php_svn_handle_error(err TSRMLS_CC);
                           ^~~~~~~~~~
                           )

/tmp/ext-src/trunk/svn.c: In function 'zif_svn_fs_props_changed':

/tmp/ext-src/trunk/svn.c:4563:55: error: expected ')' before 'TSRMLS_CC'
  if (FAILURE == zend_parse_parameters(ZEND_NUM_ARGS() TSRMLS_CC, "rsrs",
                                                       ^~~~~~~~~

/tmp/ext-src/trunk/svn.c:4563:17: error: too few arguments to function 'zend_parse_parameters'
  if (FAILURE == zend_parse_parameters(ZEND_NUM_ARGS() TSRMLS_CC, "rsrs",
                 ^~~~~~~~~~~~~~~~~~~~~

In file included from /usr/local/include/php/main/php.h:35,
                 from /tmp/ext-src/trunk/svn.c:30:
/usr/local/include/php/Zend/zend_API.h:304:22: note: declared here
 ZEND_API zend_result zend_parse_parameters(uint32_t num_args, const char *type_spec, ...);
                      ^~~~~~~~~~~~~~~~~~~~~

/tmp/ext-src/trunk/svn.c:4576:27: error: expected ')' before 'TSRMLS_CC'
   php_svn_handle_error(err TSRMLS_CC);
                           ^~~~~~~~~~
                           )

/tmp/ext-src/trunk/svn.c:4582:27: error: expected ')' before 'TSRMLS_CC'
   php_svn_handle_error(err TSRMLS_CC);
                           ^~~~~~~~~~
                           )

/tmp/ext-src/trunk/svn.c:4587:2: warning: 'svn_path_canonicalize' is deprecated [-Wdeprecated-declarations]
  path1 = svn_path_canonicalize(utf8_path1, subpool);
  ^~~~~

In file included from /tmp/ext-src/trunk/svn.c:40:
/usr/include/subversion-1/svn_path.h:284:1: note: declared here
 svn_path_canonicalize(const char *path, apr_pool_t *pool);
 ^~~~~~~~~~~~~~~~~~~~~

/tmp/ext-src/trunk/svn.c:4588:2: warning: 'svn_path_canonicalize' is deprecated [-Wdeprecated-declarations]
  path2 = svn_path_canonicalize(utf8_path2, subpool);
  ^~~~~

In file included from /tmp/ext-src/trunk/svn.c:40:
/usr/include/subversion-1/svn_path.h:284:1: note: declared here
 svn_path_canonicalize(const char *path, apr_pool_t *pool);
 ^~~~~~~~~~~~~~~~~~~~~

/tmp/ext-src/trunk/svn.c:4597:27: error: expected ')' before 'TSRMLS_CC'
   php_svn_handle_error(err TSRMLS_CC);
                           ^~~~~~~~~~
                           )

/tmp/ext-src/trunk/svn.c: In function 'zif_svn_fs_abort_txn':

/tmp/ext-src/trunk/svn.c:4618:55: error: expected ')' before 'TSRMLS_CC'
  if (FAILURE == zend_parse_parameters(ZEND_NUM_ARGS() TSRMLS_CC, "r",
                                                       ^~~~~~~~~

/tmp/ext-src/trunk/svn.c:4618:17: error: too few arguments to function 'zend_parse_parameters'
  if (FAILURE == zend_parse_parameters(ZEND_NUM_ARGS() TSRMLS_CC, "r",
                 ^~~~~~~~~~~~~~~~~~~~~

In file included from /usr/local/include/php/main/php.h:35,
                 from /tmp/ext-src/trunk/svn.c:30:
/usr/local/include/php/Zend/zend_API.h:304:22: note: declared here
 ZEND_API zend_result zend_parse_parameters(uint32_t num_args, const char *type_spec, ...);
                      ^~~~~~~~~~~~~~~~~~~~~

/tmp/ext-src/trunk/svn.c:4628:27: error: expected ')' before 'TSRMLS_CC'
   php_svn_handle_error(err TSRMLS_CC);
                           ^~~~~~~~~~
                           )

/tmp/ext-src/trunk/svn.c: In function 'zif_svn_fs_open_txn':

/tmp/ext-src/trunk/svn.c:4650:55: error: expected ')' before 'TSRMLS_CC'
  if (FAILURE == zend_parse_parameters(ZEND_NUM_ARGS() TSRMLS_CC, "rs",
                                                       ^~~~~~~~~

/tmp/ext-src/trunk/svn.c:4650:17: error: too few arguments to function 'zend_parse_parameters'
  if (FAILURE == zend_parse_parameters(ZEND_NUM_ARGS() TSRMLS_CC, "rs",
                 ^~~~~~~~~~~~~~~~~~~~~

In file included from /usr/local/include/php/main/php.h:35,
                 from /tmp/ext-src/trunk/svn.c:30:
/usr/local/include/php/Zend/zend_API.h:304:22: note: declared here
 ZEND_API zend_result zend_parse_parameters(uint32_t num_args, const char *type_spec, ...);
                      ^~~~~~~~~~~~~~~~~~~~~

/tmp/ext-src/trunk/svn.c:4664:27: error: expected ')' before 'TSRMLS_CC'
   php_svn_handle_error(err TSRMLS_CC);
                           ^~~~~~~~~~
                           )

/tmp/ext-src/trunk/svn.c: In function 'zif_svn_fs_txn_prop':

/tmp/ext-src/trunk/svn.c:4696:55: error: expected ')' before 'TSRMLS_CC'
  if (FAILURE == zend_parse_parameters(ZEND_NUM_ARGS() TSRMLS_CC, "rs",
                                                       ^~~~~~~~~

/tmp/ext-src/trunk/svn.c:4696:17: error: too few arguments to function 'zend_parse_parameters'
  if (FAILURE == zend_parse_parameters(ZEND_NUM_ARGS() TSRMLS_CC, "rs",
                 ^~~~~~~~~~~~~~~~~~~~~

In file included from /usr/local/include/php/main/php.h:35,
                 from /tmp/ext-src/trunk/svn.c:30:
/usr/local/include/php/Zend/zend_API.h:304:22: note: declared here
 ZEND_API zend_result zend_parse_parameters(uint32_t num_args, const char *type_spec, ...);
                      ^~~~~~~~~~~~~~~~~~~~~

/tmp/ext-src/trunk/svn.c:4710:27: error: expected ')' before 'TSRMLS_CC'
   php_svn_handle_error(err TSRMLS_CC);
                           ^~~~~~~~~~
                           )

make: *** [Makefile:209: svn.lo] Error 1