php-ext.com / svn (from pecl using PHP 7.3.28-zts-buster)

Dockerfile
FROM php:7.3.28-zts-buster
WORKDIR /tmp
RUN apt update && \
    apt install -y --no-install-recommends git subversion autoconf build-essential && \
    apt install -y --no-install-recommends libsvn-dev git-svn && \
    rm -rf /var/lib/apt/lists/*
RUN pecl install --force svn && \
    pecl run-tests svn
Build output FAIL 11ss
Step 1/4 : FROM php:7.3.28-zts-buster
---> b7f4c7bf7df3
Step 2/4 : WORKDIR /tmp
---> Running in f06793ea316e
Removing intermediate container f06793ea316e
---> e63a7bfc639b
Step 3/4 : RUN apt update && apt install -y --no-install-recommends git subversion autoconf build-essential && apt install -y --no-install-recommends libsvn-dev git-svn && rm -rf /var/lib/apt/lists/*
---> Running in e20ad0642595


WARNING: apt does not have a stable CLI interface. Use with caution in scripts.


Get:1 http://security.debian.org/debian-security buster/updates InRelease [65.4 kB]
Get:2 http://deb.debian.org/debian buster InRelease [121 kB]
Get:3 http://deb.debian.org/debian buster-updates InRelease [51.9 kB]
Get:4 http://security.debian.org/debian-security buster/updates/main amd64 Packages [285 kB]
Get:5 http://deb.debian.org/debian buster/main amd64 Packages [7907 kB]
Get:6 http://deb.debian.org/debian buster-updates/main amd64 Packages [10.9 kB]
Fetched 8441 kB in 1s (5830 kB/s)
Reading package lists...
Building dependency tree...
Reading state information...
2 packages can be upgraded. Run 'apt list --upgradable' to see them.


WARNING: 
apt
 
does not have a stable CLI interface. 
Use with caution in scripts.




Reading package lists...
Building dependency tree...
Reading state information...
autoconf is already the newest version (2.69-11).
The following package was automatically installed and is no longer required:
lsb-base
Use 'apt autoremove' to remove it.
The following additional packages will be installed:
git-man libapr1 libaprutil1 libcurl3-gnutls liberror-perl libexpat1
libpcre2-8-0 libserf-1-1 libsvn1 libutf8proc2
Suggested packages:
gettext-base git-daemon-run | git-daemon-sysvinit git-doc git-el git-email
git-gui gitk gitweb git-cvs git-mediawiki git-svn db5.3-util
libapache2-mod-svn subversion-tools
Recommended packages:
less ssh-client
The following NEW packages will be installed:
build-essential git git-man libapr1 libaprutil1 libcurl3-gnutls
liberror-perl libexpat1 libpcre2-8-0 libserf-1-1 libsvn1 libutf8proc2
subversion
0 upgraded, 13 newly installed, 0 to remove and 2 not upgraded.
Need to get 10.7 MB of archives.
After this operation, 50.2 MB of additional disk space will be used.
Get:1 http://security.debian.org/debian-security buster/updates/main amd64 libcurl3-gnutls amd64 7.64.0-4+deb10u2 [330 kB]
Get:2 http://deb.debian.org/debian buster/main amd64 build-essential amd64 12.6 [7576 B]
Get:3 http://deb.debian.org/debian buster/main amd64 libexpat1 amd64 2.2.6-2+deb10u1 [106 kB]
Get:4 http://deb.debian.org/debian buster/main amd64 libpcre2-8-0 amd64 10.32-5 [213 kB]
Get:5 http://deb.debian.org/debian buster/main amd64 liberror-perl all 0.17027-2 [30.9 kB]
Get:6 http://deb.debian.org/debian buster/main amd64 git-man all 1:2.20.1-2+deb10u3 [1620 kB]
Get:7 http://deb.debian.org/debian buster/main amd64 git amd64 1:2.20.1-2+deb10u3 [5633 kB]
Get:8 http://deb.debian.org/debian buster/main amd64 libapr1 amd64 1.6.5-1+b1 [102 kB]
Get:9 http://deb.debian.org/debian buster/main amd64 libaprutil1 amd64 1.6.1-4 [91.8 kB]
Get:10 http://deb.debian.org/debian buster/main amd64 libserf-1-1 amd64 1.3.9-7+b10 [53.6 kB]
Get:11 http://deb.debian.org/debian buster/main amd64 libutf8proc2 amd64 2.3.0-1 [53.0 kB]
Get:12 http://deb.debian.org/debian buster/main amd64 libsvn1 amd64 1.10.4-1+deb10u2 [1403 kB]
Get:13 http://deb.debian.org/debian buster/main amd64 subversion amd64 1.10.4-1+deb10u2 [1008 kB]
debconf: delaying package configuration, since apt-utils is not installed

Fetched 10.7 MB in 0s (85.3 MB/s)
Selecting previously unselected package build-essential.
(Reading database ...
(Reading database ... 5%
(Reading database ... 10%
(Reading database ... 15%
(Reading database ... 20%
(Reading database ... 25%
(Reading database ... 30%
(Reading database ... 35%
(Reading database ... 40%
(Reading database ... 45%
(Reading database ... 50%
(Reading database ... 55%
(Reading database ... 60%
(Reading database ... 65%
(Reading database ... 70%
(Reading database ... 75%
(Reading database ... 80%
(Reading database ... 85%
(Reading database ... 90%
(Reading database ... 95%
(Reading database ... 100%
(Reading database ...
12684 files and directories currently installed.)
Preparing to unpack .../00-build-essential_12.6_amd64.deb ...
Unpacking build-essential (12.6) ...
Selecting previously unselected package libcurl3-gnutls:amd64.
Preparing to unpack .../01-libcurl3-gnutls_7.64.0-4+deb10u2_amd64.deb ...
Unpacking libcurl3-gnutls:amd64 (7.64.0-4+deb10u2) ...
Selecting previously unselected package libexpat1:amd64.
Preparing to unpack .../02-libexpat1_2.2.6-2+deb10u1_amd64.deb ...
Unpacking libexpat1:amd64 (2.2.6-2+deb10u1) ...
Selecting previously unselected package libpcre2-8-0:amd64.
Preparing to unpack .../03-libpcre2-8-0_10.32-5_amd64.deb ...
Unpacking libpcre2-8-0:amd64 (10.32-5) ...
Selecting previously unselected package liberror-perl.
Preparing to unpack .../04-liberror-perl_0.17027-2_all.deb ...
Unpacking liberror-perl (0.17027-2) ...
Selecting previously unselected package git-man.
Preparing to unpack .../05-git-man_1%3a2.20.1-2+deb10u3_all.deb ...
Unpacking git-man (1:2.20.1-2+deb10u3) ...
Selecting previously unselected package git.
Preparing to unpack .../06-git_1%3a2.20.1-2+deb10u3_amd64.deb ...
Unpacking git (1:2.20.1-2+deb10u3) ...
Selecting previously unselected package libapr1:amd64.
Preparing to unpack .../07-libapr1_1.6.5-1+b1_amd64.deb ...
Unpacking libapr1:amd64 (1.6.5-1+b1) ...
Selecting previously unselected package libaprutil1:amd64.
Preparing to unpack .../08-libaprutil1_1.6.1-4_amd64.deb ...
Unpacking libaprutil1:amd64 (1.6.1-4) ...
Selecting previously unselected package libserf-1-1:amd64.
Preparing to unpack .../09-libserf-1-1_1.3.9-7+b10_amd64.deb ...
Unpacking libserf-1-1:amd64 (1.3.9-7+b10) ...
Selecting previously unselected package libutf8proc2:amd64.
Preparing to unpack .../10-libutf8proc2_2.3.0-1_amd64.deb ...
Unpacking libutf8proc2:amd64 (2.3.0-1) ...
Selecting previously unselected package libsvn1:amd64.
Preparing to unpack .../11-libsvn1_1.10.4-1+deb10u2_amd64.deb ...
Unpacking libsvn1:amd64 (1.10.4-1+deb10u2) ...
Selecting previously unselected package subversion.
Preparing to unpack .../12-subversion_1.10.4-1+deb10u2_amd64.deb ...
Unpacking subversion (1.10.4-1+deb10u2) ...
Setting up libexpat1:amd64 (2.2.6-2+deb10u1) ...
Setting up libutf8proc2:amd64 (2.3.0-1) ...
Setting up libapr1:amd64 (1.6.5-1+b1) ...
Setting up libcurl3-gnutls:amd64 (7.64.0-4+deb10u2) ...
Setting up liberror-perl (0.17027-2) ...
Setting up libpcre2-8-0:amd64 (10.32-5) ...
Setting up build-essential (12.6) ...
Setting up git-man (1:2.20.1-2+deb10u3) ...
Setting up libaprutil1:amd64 (1.6.1-4) ...
Setting up libserf-1-1:amd64 (1.3.9-7+b10) ...
Setting up git (1:2.20.1-2+deb10u3) ...
Setting up libsvn1:amd64 (1.10.4-1+deb10u2) ...
Setting up subversion (1.10.4-1+deb10u2) ...
Processing triggers for libc-bin (2.28-10) ...


WARNING: 
apt
 
does not have a stable CLI interface. 
Use with caution in scripts.




Reading package lists...
Building dependency tree...
Reading state information...
The following package was automatically installed and is no longer required:
lsb-base
Use 'apt autoremove' to remove it.
The following additional packages will be installed:
libapr1-dev libaprutil1-dev libexpat1-dev libldap2-dev libsctp-dev libsctp1
libsvn-perl libterm-readkey-perl libyaml-perl uuid-dev
Suggested packages:
git-doc python lksctp-tools libserf-dev libsvn-doc zlib1g-dev
libyaml-shell-perl
Recommended packages:
libyaml-libyaml-perl | libyaml-syck-perl
The following NEW packages will be installed:
git-svn libapr1-dev libaprutil1-dev libexpat1-dev libldap2-dev libsctp-dev
libsctp1 libsvn-dev libsvn-perl libterm-readkey-perl libyaml-perl uuid-dev
0 upgraded, 12 newly installed, 0 to remove and 2 not upgraded.
Need to get 5536 kB of archives.
After this operation, 32.1 MB of additional disk space will be used.
Get:1 http://deb.debian.org/debian buster/main amd64 libsvn-perl amd64 1.10.4-1+deb10u2 [1044 kB]
Get:2 http://deb.debian.org/debian buster/main amd64 libyaml-perl all 1.27-1 [66.8 kB]
Get:3 http://deb.debian.org/debian buster/main amd64 libterm-readkey-perl amd64 2.38-1 [27.4 kB]
Get:4 http://deb.debian.org/debian buster/main amd64 git-svn all 1:2.20.1-2+deb10u3 [867 kB]
Get:5 http://deb.debian.org/debian buster/main amd64 uuid-dev amd64 2.33.1-0.1 [93.6 kB]
Get:6 http://deb.debian.org/debian buster/main amd64 libsctp1 amd64 1.0.18+dfsg-1 [28.3 kB]
Get:7 http://deb.debian.org/debian buster/main amd64 libsctp-dev amd64 1.0.18+dfsg-1 [81.5 kB]
Get:8 http://deb.debian.org/debian buster/main amd64 libapr1-dev amd64 1.6.5-1+b1 [707 kB]
Get:9 http://deb.debian.org/debian buster/main amd64 libldap2-dev amd64 2.4.47+dfsg-3+deb10u6 [332 kB]
Get:10 http://deb.debian.org/debian buster/main amd64 libexpat1-dev amd64 2.2.6-2+deb10u1 [153 kB]
Get:11 http://deb.debian.org/debian buster/main amd64 libaprutil1-dev amd64 1.6.1-4 [404 kB]
Get:12 http://deb.debian.org/debian buster/main amd64 libsvn-dev amd64 1.10.4-1+deb10u2 [1731 kB]
debconf: delaying package configuration, since apt-utils is not installed

Fetched 5536 kB in 0s (64.7 MB/s)
Selecting previously unselected package libsvn-perl:amd64.
(Reading database ...
(Reading database ... 5%
(Reading database ... 10%
(Reading database ... 15%
(Reading database ... 20%
(Reading database ... 25%
(Reading database ... 30%
(Reading database ... 35%
(Reading database ... 40%
(Reading database ... 45%
(Reading database ... 50%
(Reading database ... 55%
(Reading database ... 60%
(Reading database ... 65%
(Reading database ... 70%
(Reading database ... 75%
(Reading database ... 80%
(Reading database ... 85%
(Reading database ... 90%
(Reading database ... 95%
(Reading database ... 100%
(Reading database ...
13806 files and directories currently installed.)
Preparing to unpack .../00-libsvn-perl_1.10.4-1+deb10u2_amd64.deb ...
Unpacking libsvn-perl:amd64 (1.10.4-1+deb10u2) ...
Selecting previously unselected package libyaml-perl.
Preparing to unpack .../01-libyaml-perl_1.27-1_all.deb ...
Unpacking libyaml-perl (1.27-1) ...
Selecting previously unselected package libterm-readkey-perl.
Preparing to unpack .../02-libterm-readkey-perl_2.38-1_amd64.deb ...
Unpacking libterm-readkey-perl (2.38-1) ...
Selecting previously unselected package git-svn.
Preparing to unpack .../03-git-svn_1%3a2.20.1-2+deb10u3_all.deb ...
Unpacking git-svn (1:2.20.1-2+deb10u3) ...
Selecting previously unselected package uuid-dev:amd64.
Preparing to unpack .../04-uuid-dev_2.33.1-0.1_amd64.deb ...
Unpacking uuid-dev:amd64 (2.33.1-0.1) ...
Selecting previously unselected package libsctp1:amd64.
Preparing to unpack .../05-libsctp1_1.0.18+dfsg-1_amd64.deb ...
Unpacking libsctp1:amd64 (1.0.18+dfsg-1) ...
Selecting previously unselected package libsctp-dev:amd64.
Preparing to unpack .../06-libsctp-dev_1.0.18+dfsg-1_amd64.deb ...
Unpacking libsctp-dev:amd64 (1.0.18+dfsg-1) ...
Selecting previously unselected package libapr1-dev.
Preparing to unpack .../07-libapr1-dev_1.6.5-1+b1_amd64.deb ...
Unpacking libapr1-dev (1.6.5-1+b1) ...
Selecting previously unselected package libldap2-dev:amd64.
Preparing to unpack .../08-libldap2-dev_2.4.47+dfsg-3+deb10u6_amd64.deb ...
Unpacking libldap2-dev:amd64 (2.4.47+dfsg-3+deb10u6) ...
Selecting previously unselected package libexpat1-dev:amd64.
Preparing to unpack .../09-libexpat1-dev_2.2.6-2+deb10u1_amd64.deb ...
Unpacking libexpat1-dev:amd64 (2.2.6-2+deb10u1) ...
Selecting previously unselected package libaprutil1-dev.
Preparing to unpack .../10-libaprutil1-dev_1.6.1-4_amd64.deb ...
Unpacking libaprutil1-dev (1.6.1-4) ...
Selecting previously unselected package libsvn-dev:amd64.
Preparing to unpack .../11-libsvn-dev_1.10.4-1+deb10u2_amd64.deb ...
Unpacking libsvn-dev:amd64 (1.10.4-1+deb10u2) ...
Setting up libsvn-perl:amd64 (1.10.4-1+deb10u2) ...
Setting up libyaml-perl (1.27-1) ...
Setting up libldap2-dev:amd64 (2.4.47+dfsg-3+deb10u6) ...
Setting up libexpat1-dev:amd64 (2.2.6-2+deb10u1) ...
Setting up uuid-dev:amd64 (2.33.1-0.1) ...
Setting up libsctp1:amd64 (1.0.18+dfsg-1) ...
Setting up libterm-readkey-perl (2.38-1) ...
Setting up git-svn (1:2.20.1-2+deb10u3) ...
Setting up libsctp-dev:amd64 (1.0.18+dfsg-1) ...
Setting up libapr1-dev (1.6.5-1+b1) ...
Setting up libaprutil1-dev (1.6.1-4) ...
Setting up libsvn-dev:amd64 (1.10.4-1+deb10u2) ...
Processing triggers for libc-bin (2.28-10) ...
Removing intermediate container e20ad0642595
---> dd0a7589c403
Step 4/4 : RUN pecl install --force svn && pecl run-tests svn
---> Running in 0c6187fa7329
warning: pecl/svn requires PHP (version >= 4.0.0, version <= 6.0.0), installed version is 7.3.28
downloading svn-1.0.3.tgz ...
Starting to download svn-1.0.3.tgz (27,216 bytes)
.
.
.
.
.
.
...done: 27,216 bytes
4 source files, building
running: phpize
Configuring for:
PHP Api Version:         20180731
Zend Module Api No:      20180731
Zend Extension Api No:   320180731
Please provide the prefix of Subversion installation
[autodetect]
:
Please provide the prefix of the APR installation used with Subversion
[autodetect]
:
building in /tmp/pear/temp/pear-build-defaultusermGuxtq/svn-1.0.3
running: /tmp/pear/temp/svn/configure --with-php-config=/usr/local/bin/php-config --with-svn --with-svn-apr
checking for grep that handles long lines and -e... /bin/grep
checking for egrep... /bin/grep -E
checking for a sed that does not truncate output... /bin/sed
checking for cc... cc
checking whether the C compiler works... yes
checking for C compiler default output file name... a.out
checking for suffix of executables...
checking whether we are cross compiling... no
checking for suffix of object files... o
checking whether we are using the GNU C compiler... yes
checking whether cc accepts -g... yes
checking for cc option to accept ISO C89... none needed
checking how to run the C preprocessor... cc -E
checking for icc... no
checking for suncc... no
checking whether cc understands -c and -o together... yes
checking for system library directory... lib
checking if compiler supports -R... no
checking if compiler supports -Wl,-rpath,... yes
checking build system type... x86_64-pc-linux-gnu
checking host system type... x86_64-pc-linux-gnu
checking target system type... x86_64-pc-linux-gnu
checking for PHP prefix... /usr/local
checking for PHP includes... -I/usr/local/include/php -I/usr/local/include/php/main -I/usr/local/include/php/TSRM -I/usr/local/include/php/Zend -I/usr/local/include/php/ext -I/usr/local/include/php/ext/date/lib
checking for PHP extension directory... /usr/local/lib/php/extensions/no-debug-zts-20180731
checking for PHP installed headers prefix... /usr/local/include/php
checking if debug is enabled... no
checking if zts is enabled... yes
checking for re2c... re2c
checking for re2c version... 1.1.1 (ok)
checking for gawk... no
checking for nawk... nawk
checking if nawk is broken... no
checking for svn support... yes, shared
checking for specifying the location of apr for svn... yes, shared
checking for svn includes... Found libsvn 1.10.4
checking for apr and apr-util... Found apr 1.6.5
libsvn includes: "-I/usr/include/subversion-1 -I/usr/include/apr-1.0 -DLINUX -D_REENTRANT -D_GNU_SOURCE"
libsvn ldflags: "-lsvn_client-1 -lsvn_fs-1 -lsvn_repos-1 -lsvn_subr-1 -L/usr/lib/x86_64-linux-gnu -lapr-1"
checking for ld used by cc... /usr/bin/ld
checking if the linker (/usr/bin/ld) is GNU ld... yes
checking for /usr/bin/ld option to reload object files... -r
checking for BSD-compatible nm... /usr/bin/nm -B
checking whether ln -s works... yes
checking how to recognize dependent libraries... pass_all
checking for ANSI C header files... yes
checking for sys/types.h... yes
checking for sys/stat.h... yes
checking for stdlib.h... yes
checking for string.h... yes
checking for memory.h... yes
checking for strings.h... yes
checking for inttypes.h... yes
checking for stdint.h... yes
checking for unistd.h... yes
checking dlfcn.h usability... yes
checking dlfcn.h presence... yes
checking for dlfcn.h... yes
checking the maximum length of command line arguments... 1572864
checking command to parse /usr/bin/nm -B output from cc object... ok
checking for objdir... .libs
checking for ar... ar
checking for ranlib... ranlib
checking for strip... strip
checking if cc supports -fno-rtti -fno-exceptions... no
checking for cc option to produce PIC... -fPIC
checking if cc PIC flag -fPIC works... yes
checking if cc static flag -static works... yes
checking if cc supports -c -o file.o... yes
checking whether the cc linker (/usr/bin/ld -m elf_x86_64) supports shared libraries... yes
checking whether -lc should be explicitly linked in... no
checking dynamic linker characteristics... GNU/Linux ld.so
checking how to hardcode library paths into programs... immediate
checking whether stripping libraries is possible... yes
checking if libtool supports shared libraries... yes
checking whether to build shared libraries... yes
checking whether to build static libraries... no
creating libtool
appending configuration tag "CXX" to libtool
configure: creating ./config.status
config.status: creating config.h
running: make
/bin/bash /tmp/pear/temp/pear-build-defaultusermGuxtq/svn-1.0.3/libtool --mode=compile cc -I/usr/include/subversion-1  -I/usr/include/apr-1.0   -DLINUX -D_REENTRANT -D_GNU_SOURCE -I. -I/tmp/pear/temp/svn -DPHP_ATOM_INC -I/tmp/pear/temp/pear-build-defaultusermGuxtq/svn-1.0.3/include -I/tmp/pear/temp/pear-build-defaultusermGuxtq/svn-1.0.3/main -I/tmp/pear/temp/svn -I/usr/local/include/php -I/usr/local/include/php/main -I/usr/local/include/php/TSRM -I/usr/local/include/php/Zend -I/usr/local/include/php/ext -I/usr/local/include/php/ext/date/lib -I/usr/include/subversion-1 -I/usr/include/apr-1.0 -DLINUX -D_REENTRANT -D_GNU_SOURCE  -DHAVE_CONFIG_H  -g -O2   -c /tmp/pear/temp/svn/svn.c -o svn.lo
mkdir .libs
cc -I/usr/include/subversion-1 -I/usr/include/apr-1.0 -DLINUX -D_REENTRANT -D_GNU_SOURCE -I. -I/tmp/pear/temp/svn -DPHP_ATOM_INC -I/tmp/pear/temp/pear-build-defaultusermGuxtq/svn-1.0.3/include -I/tmp/pear/temp/pear-build-defaultusermGuxtq/svn-1.0.3/main -I/tmp/pear/temp/svn -I/usr/local/include/php -I/usr/local/include/php/main -I/usr/local/include/php/TSRM -I/usr/local/include/php/Zend -I/usr/local/include/php/ext -I/usr/local/include/php/ext/date/lib -I/usr/include/subversion-1 -I/usr/include/apr-1.0 -DLINUX -D_REENTRANT -D_GNU_SOURCE -DHAVE_CONFIG_H -g -O2 -c /tmp/pear/temp/svn/svn.c  -fPIC -DPIC -o .libs/svn.o
/tmp/pear/temp/svn/svn.c: In function 'php_svn_repos_dtor':
/tmp/pear/temp/svn/svn.c:99:28: error: 'rsrc' undeclared (first use in this function)
struct php_svn_repos *r = rsrc->ptr;
^~~~
/tmp/pear/temp/svn/svn.c:99:28: note: each undeclared identifier is reported only once for each function it appears in
/tmp/pear/temp/svn/svn.c: In function 'php_svn_fs_dtor':
/tmp/pear/temp/svn/svn.c:109:25: error: 'rsrc' undeclared (first use in this function)
struct php_svn_fs *r = rsrc->ptr;
^~~~
/tmp/pear/temp/svn/svn.c:110:27: warning: passing argument 1 of 'zend_list_delete' makes pointer from integer without a cast [-Wint-conversion]
zend_list_delete(r->repos->rsrc_id);
~~~~~~~~^~~~~~~~~
In file included from /usr/local/include/php/Zend/zend_API.h:26,
from /usr/local/include/php/main/php.h:37,
from /tmp/pear/temp/svn/svn.c:30:
/usr/local/include/php/Zend/zend_list.h:57:60: note: expected 'zend_resource *' {aka 'struct _zend_resource *'} but argument is of type 'long int'
ZEND_API int ZEND_FASTCALL zend_list_delete(zend_resource *res);
~~~~~~~~~~~~~~~^~~
/tmp/pear/temp/svn/svn.c: In function 'php_svn_fs_root_dtor':
/tmp/pear/temp/svn/svn.c:116:30: error: 'rsrc' undeclared (first use in this function)
struct php_svn_fs_root *r = rsrc->ptr;
^~~~
/tmp/pear/temp/svn/svn.c:117:27: warning: passing argument 1 of 'zend_list_delete' makes pointer from integer without a cast [-Wint-conversion]
zend_list_delete(r->repos->rsrc_id);
~~~~~~~~^~~~~~~~~
In file included from /usr/local/include/php/Zend/zend_API.h:26,
from /usr/local/include/php/main/php.h:37,
from /tmp/pear/temp/svn/svn.c:30:
/usr/local/include/php/Zend/zend_list.h:57:60: note: expected 'zend_resource *' {aka 'struct _zend_resource *'} but argument is of type 'long int'
ZEND_API int ZEND_FASTCALL zend_list_delete(zend_resource *res);
~~~~~~~~~~~~~~~^~~
/tmp/pear/temp/svn/svn.c: In function 'php_svn_repos_fs_txn_dtor':
/tmp/pear/temp/svn/svn.c:123:35: error: 'rsrc' undeclared (first use in this function)
struct php_svn_repos_fs_txn *r = rsrc->ptr;
^~~~
/tmp/pear/temp/svn/svn.c:124:27: warning: passing argument 1 of 'zend_list_delete' makes pointer from integer without a cast [-Wint-conversion]
zend_list_delete(r->repos->rsrc_id);
~~~~~~~~^~~~~~~~~
In file included from /usr/local/include/php/Zend/zend_API.h:26,
from /usr/local/include/php/main/php.h:37,
from /tmp/pear/temp/svn/svn.c:30:
/usr/local/include/php/Zend/zend_list.h:57:60: note: expected 'zend_resource *' {aka 'struct _zend_resource *'} but argument is of type 'long int'
ZEND_API int ZEND_FASTCALL zend_list_delete(zend_resource *res);
~~~~~~~~~~~~~~~^~~
/tmp/pear/temp/svn/svn.c: At top level:
/tmp/pear/temp/svn/svn.c:300:10: fatal error: ext/standard/php_smart_str.h: No such file or directory
#include "ext/standard/php_smart_str.h"
^~~~~~~~~~~~~~~~~~~~~~~~~~~~~~
compilation terminated.
make: *** [Makefile:194: svn.lo] Error 1
ERROR: `make' failed