php-ext.com / zmq (from pecl using PHP 7.3.28-zts-buster)

Dockerfile
FROM php:7.3.28-zts-buster
WORKDIR /tmp
RUN apt update && \
    apt install -y --no-install-recommends git subversion autoconf build-essential && \
    apt install -y --no-install-recommends libzmq3-dev && \
    rm -rf /var/lib/apt/lists/*
RUN pecl install --force zmq && \
    pecl run-tests zmq
Build output FAIL 13ss
Step 1/4 : FROM php:7.3.28-zts-buster
---> b7f4c7bf7df3
Step 2/4 : WORKDIR /tmp
---> Running in 2747cd0aebe4
Removing intermediate container 2747cd0aebe4
---> 75799057a595
Step 3/4 : RUN apt update && apt install -y --no-install-recommends git subversion autoconf build-essential && apt install -y --no-install-recommends libzmq3-dev && rm -rf /var/lib/apt/lists/*
---> Running in 1ad591e5db41


WARNING: apt does not have a stable CLI interface. Use with caution in scripts.


Get:1 http://security.debian.org/debian-security buster/updates InRelease [65.4 kB]
Get:2 http://deb.debian.org/debian buster InRelease [121 kB]
Get:3 http://deb.debian.org/debian buster-updates InRelease [51.9 kB]
Get:4 http://security.debian.org/debian-security buster/updates/main amd64 Packages [285 kB]
Get:5 http://deb.debian.org/debian buster/main amd64 Packages [7907 kB]
Get:6 http://deb.debian.org/debian buster-updates/main amd64 Packages [10.9 kB]
Fetched 8441 kB in 1s (5851 kB/s)
Reading package lists...
Building dependency tree...
Reading state information...
2 packages can be upgraded. Run 'apt list --upgradable' to see them.


WARNING: 
apt
 
does not have a stable CLI interface. 
Use with caution in scripts.




Reading package lists...
Building dependency tree...
Reading state information...
autoconf is already the newest version (2.69-11).
The following package was automatically installed and is no longer required:
lsb-base
Use 'apt autoremove' to remove it.
The following additional packages will be installed:
git-man libapr1 libaprutil1 libcurl3-gnutls liberror-perl libexpat1
libpcre2-8-0 libserf-1-1 libsvn1 libutf8proc2
Suggested packages:
gettext-base git-daemon-run | git-daemon-sysvinit git-doc git-el git-email
git-gui gitk gitweb git-cvs git-mediawiki git-svn db5.3-util
libapache2-mod-svn subversion-tools
Recommended packages:
less ssh-client
The following NEW packages will be installed:
build-essential git git-man libapr1 libaprutil1 libcurl3-gnutls
liberror-perl libexpat1 libpcre2-8-0 libserf-1-1 libsvn1 libutf8proc2
subversion
0 upgraded, 13 newly installed, 0 to remove and 2 not upgraded.
Need to get 10.7 MB of archives.
After this operation, 50.2 MB of additional disk space will be used.
Get:1 http://security.debian.org/debian-security buster/updates/main amd64 libcurl3-gnutls amd64 7.64.0-4+deb10u2 [330 kB]
Get:2 http://deb.debian.org/debian buster/main amd64 build-essential amd64 12.6 [7576 B]
Get:3 http://deb.debian.org/debian buster/main amd64 libexpat1 amd64 2.2.6-2+deb10u1 [106 kB]
Get:4 http://deb.debian.org/debian buster/main amd64 libpcre2-8-0 amd64 10.32-5 [213 kB]
Get:5 http://deb.debian.org/debian buster/main amd64 liberror-perl all 0.17027-2 [30.9 kB]
Get:6 http://deb.debian.org/debian buster/main amd64 git-man all 1:2.20.1-2+deb10u3 [1620 kB]
Get:7 http://deb.debian.org/debian buster/main amd64 git amd64 1:2.20.1-2+deb10u3 [5633 kB]
Get:8 http://deb.debian.org/debian buster/main amd64 libapr1 amd64 1.6.5-1+b1 [102 kB]
Get:9 http://deb.debian.org/debian buster/main amd64 libaprutil1 amd64 1.6.1-4 [91.8 kB]
Get:10 http://deb.debian.org/debian buster/main amd64 libserf-1-1 amd64 1.3.9-7+b10 [53.6 kB]
Get:11 http://deb.debian.org/debian buster/main amd64 libutf8proc2 amd64 2.3.0-1 [53.0 kB]
Get:12 http://deb.debian.org/debian buster/main amd64 libsvn1 amd64 1.10.4-1+deb10u2 [1403 kB]
Get:13 http://deb.debian.org/debian buster/main amd64 subversion amd64 1.10.4-1+deb10u2 [1008 kB]
debconf: delaying package configuration, since apt-utils is not installed

Fetched 10.7 MB in 1s (7756 kB/s)
Selecting previously unselected package build-essential.
(Reading database ...
(Reading database ... 5%
(Reading database ... 10%
(Reading database ... 15%
(Reading database ... 20%
(Reading database ... 25%
(Reading database ... 30%
(Reading database ... 35%
(Reading database ... 40%
(Reading database ... 45%
(Reading database ... 50%
(Reading database ... 55%
(Reading database ... 60%
(Reading database ... 65%
(Reading database ... 70%
(Reading database ... 75%
(Reading database ... 80%
(Reading database ... 85%
(Reading database ... 90%
(Reading database ... 95%
(Reading database ... 100%
(Reading database ...
12684 files and directories currently installed.)
Preparing to unpack .../00-build-essential_12.6_amd64.deb ...
Unpacking build-essential (12.6) ...
Selecting previously unselected package libcurl3-gnutls:amd64.
Preparing to unpack .../01-libcurl3-gnutls_7.64.0-4+deb10u2_amd64.deb ...
Unpacking libcurl3-gnutls:amd64 (7.64.0-4+deb10u2) ...
Selecting previously unselected package libexpat1:amd64.
Preparing to unpack .../02-libexpat1_2.2.6-2+deb10u1_amd64.deb ...
Unpacking libexpat1:amd64 (2.2.6-2+deb10u1) ...
Selecting previously unselected package libpcre2-8-0:amd64.
Preparing to unpack .../03-libpcre2-8-0_10.32-5_amd64.deb ...
Unpacking libpcre2-8-0:amd64 (10.32-5) ...
Selecting previously unselected package liberror-perl.
Preparing to unpack .../04-liberror-perl_0.17027-2_all.deb ...
Unpacking liberror-perl (0.17027-2) ...
Selecting previously unselected package git-man.
Preparing to unpack .../05-git-man_1%3a2.20.1-2+deb10u3_all.deb ...
Unpacking git-man (1:2.20.1-2+deb10u3) ...
Selecting previously unselected package git.
Preparing to unpack .../06-git_1%3a2.20.1-2+deb10u3_amd64.deb ...
Unpacking git (1:2.20.1-2+deb10u3) ...
Selecting previously unselected package libapr1:amd64.
Preparing to unpack .../07-libapr1_1.6.5-1+b1_amd64.deb ...
Unpacking libapr1:amd64 (1.6.5-1+b1) ...
Selecting previously unselected package libaprutil1:amd64.
Preparing to unpack .../08-libaprutil1_1.6.1-4_amd64.deb ...
Unpacking libaprutil1:amd64 (1.6.1-4) ...
Selecting previously unselected package libserf-1-1:amd64.
Preparing to unpack .../09-libserf-1-1_1.3.9-7+b10_amd64.deb ...
Unpacking libserf-1-1:amd64 (1.3.9-7+b10) ...
Selecting previously unselected package libutf8proc2:amd64.
Preparing to unpack .../10-libutf8proc2_2.3.0-1_amd64.deb ...
Unpacking libutf8proc2:amd64 (2.3.0-1) ...
Selecting previously unselected package libsvn1:amd64.
Preparing to unpack .../11-libsvn1_1.10.4-1+deb10u2_amd64.deb ...
Unpacking libsvn1:amd64 (1.10.4-1+deb10u2) ...
Selecting previously unselected package subversion.
Preparing to unpack .../12-subversion_1.10.4-1+deb10u2_amd64.deb ...
Unpacking subversion (1.10.4-1+deb10u2) ...
Setting up libexpat1:amd64 (2.2.6-2+deb10u1) ...
Setting up libutf8proc2:amd64 (2.3.0-1) ...
Setting up libapr1:amd64 (1.6.5-1+b1) ...
Setting up libcurl3-gnutls:amd64 (7.64.0-4+deb10u2) ...
Setting up liberror-perl (0.17027-2) ...
Setting up libpcre2-8-0:amd64 (10.32-5) ...
Setting up build-essential (12.6) ...
Setting up git-man (1:2.20.1-2+deb10u3) ...
Setting up libaprutil1:amd64 (1.6.1-4) ...
Setting up libserf-1-1:amd64 (1.3.9-7+b10) ...
Setting up git (1:2.20.1-2+deb10u3) ...
Setting up libsvn1:amd64 (1.10.4-1+deb10u2) ...
Setting up subversion (1.10.4-1+deb10u2) ...
Processing triggers for libc-bin (2.28-10) ...


WARNING: 
apt
 
does not have a stable CLI interface. 
Use with caution in scripts.




Reading package lists...
Building dependency tree...
Reading state information...
The following package was automatically installed and is no longer required:
lsb-base
Use 'apt autoremove' to remove it.
The following additional packages will be installed:
comerr-dev krb5-multidev libgssrpc4 libkadm5clnt-mit11 libkadm5srv-mit11
libkdb5-9 libkrb5-dev libnorm-dev libnorm1 libpgm-5.2-0 libpgm-dev
libsodium-dev libzmq5
Suggested packages:
doc-base krb5-doc krb5-user libnorm-doc
The following NEW packages will be installed:
comerr-dev krb5-multidev libgssrpc4 libkadm5clnt-mit11 libkadm5srv-mit11
libkdb5-9 libkrb5-dev libnorm-dev libnorm1 libpgm-5.2-0 libpgm-dev
libsodium-dev libzmq3-dev libzmq5
0 upgraded, 14 newly installed, 0 to remove and 2 not upgraded.
Need to get 2588 kB of archives.
After this operation, 10.2 MB of additional disk space will be used.
Get:1 http://deb.debian.org/debian buster/main amd64 comerr-dev amd64 2.1-1.44.5-1+deb10u3 [102 kB]
Get:2 http://deb.debian.org/debian buster/main amd64 libgssrpc4 amd64 1.17-3+deb10u1 [91.2 kB]
Get:3 http://deb.debian.org/debian buster/main amd64 libkdb5-9 amd64 1.17-3+deb10u1 [73.5 kB]
Get:4 http://deb.debian.org/debian buster/main amd64 libkadm5srv-mit11 amd64 1.17-3+deb10u1 [85.7 kB]
Get:5 http://deb.debian.org/debian buster/main amd64 libkadm5clnt-mit11 amd64 1.17-3+deb10u1 [73.5 kB]
Get:6 http://deb.debian.org/debian buster/main amd64 krb5-multidev amd64 1.17-3+deb10u1 [156 kB]
Get:7 http://deb.debian.org/debian buster/main amd64 libkrb5-dev amd64 1.17-3+deb10u1 [47.5 kB]
Get:8 http://deb.debian.org/debian buster/main amd64 libnorm1 amd64 1.5.8+dfsg2-1 [287 kB]
Get:9 http://deb.debian.org/debian buster/main amd64 libnorm-dev amd64 1.5.8+dfsg2-1 [460 kB]
Get:10 http://deb.debian.org/debian buster/main amd64 libpgm-5.2-0 amd64 5.2.122~dfsg-3 [158 kB]
Get:11 http://deb.debian.org/debian buster/main amd64 libpgm-dev amd64 5.2.122~dfsg-3 [190 kB]
Get:12 http://deb.debian.org/debian buster/main amd64 libsodium-dev amd64 1.0.17-1 [176 kB]
Get:13 http://deb.debian.org/debian buster/main amd64 libzmq5 amd64 4.3.1-4+deb10u2 [246 kB]
Get:14 http://deb.debian.org/debian buster/main amd64 libzmq3-dev amd64 4.3.1-4+deb10u2 [442 kB]
debconf: delaying package configuration, since apt-utils is not installed

Fetched 2588 kB in 0s (52.5 MB/s)
Selecting previously unselected package comerr-dev:amd64.
(Reading database ...
(Reading database ... 5%
(Reading database ... 10%
(Reading database ... 15%
(Reading database ... 20%
(Reading database ... 25%
(Reading database ... 30%
(Reading database ... 35%
(Reading database ... 40%
(Reading database ... 45%
(Reading database ... 50%
(Reading database ... 55%
(Reading database ... 60%
(Reading database ... 65%
(Reading database ... 70%
(Reading database ... 75%
(Reading database ... 80%
(Reading database ... 85%
(Reading database ... 90%
(Reading database ... 95%
(Reading database ... 100%
(Reading database ...
13806 files and directories currently installed.)
Preparing to unpack .../00-comerr-dev_2.1-1.44.5-1+deb10u3_amd64.deb ...
Unpacking comerr-dev:amd64 (2.1-1.44.5-1+deb10u3) ...
Selecting previously unselected package libgssrpc4:amd64.
Preparing to unpack .../01-libgssrpc4_1.17-3+deb10u1_amd64.deb ...
Unpacking libgssrpc4:amd64 (1.17-3+deb10u1) ...
Selecting previously unselected package libkdb5-9:amd64.
Preparing to unpack .../02-libkdb5-9_1.17-3+deb10u1_amd64.deb ...
Unpacking libkdb5-9:amd64 (1.17-3+deb10u1) ...
Selecting previously unselected package libkadm5srv-mit11:amd64.
Preparing to unpack .../03-libkadm5srv-mit11_1.17-3+deb10u1_amd64.deb ...
Unpacking libkadm5srv-mit11:amd64 (1.17-3+deb10u1) ...
Selecting previously unselected package libkadm5clnt-mit11:amd64.
Preparing to unpack .../04-libkadm5clnt-mit11_1.17-3+deb10u1_amd64.deb ...
Unpacking libkadm5clnt-mit11:amd64 (1.17-3+deb10u1) ...
Selecting previously unselected package krb5-multidev:amd64.
Preparing to unpack .../05-krb5-multidev_1.17-3+deb10u1_amd64.deb ...
Unpacking krb5-multidev:amd64 (1.17-3+deb10u1) ...
Selecting previously unselected package libkrb5-dev:amd64.
Preparing to unpack .../06-libkrb5-dev_1.17-3+deb10u1_amd64.deb ...
Unpacking libkrb5-dev:amd64 (1.17-3+deb10u1) ...
Selecting previously unselected package libnorm1:amd64.
Preparing to unpack .../07-libnorm1_1.5.8+dfsg2-1_amd64.deb ...
Unpacking libnorm1:amd64 (1.5.8+dfsg2-1) ...
Selecting previously unselected package libnorm-dev:amd64.
Preparing to unpack .../08-libnorm-dev_1.5.8+dfsg2-1_amd64.deb ...
Unpacking libnorm-dev:amd64 (1.5.8+dfsg2-1) ...
Selecting previously unselected package libpgm-5.2-0:amd64.
Preparing to unpack .../09-libpgm-5.2-0_5.2.122~dfsg-3_amd64.deb ...
Unpacking libpgm-5.2-0:amd64 (5.2.122~dfsg-3) ...
Selecting previously unselected package libpgm-dev:amd64.
Preparing to unpack .../10-libpgm-dev_5.2.122~dfsg-3_amd64.deb ...
Unpacking libpgm-dev:amd64 (5.2.122~dfsg-3) ...
Selecting previously unselected package libsodium-dev:amd64.
Preparing to unpack .../11-libsodium-dev_1.0.17-1_amd64.deb ...
Unpacking libsodium-dev:amd64 (1.0.17-1) ...
Selecting previously unselected package libzmq5:amd64.
Preparing to unpack .../12-libzmq5_4.3.1-4+deb10u2_amd64.deb ...
Unpacking libzmq5:amd64 (4.3.1-4+deb10u2) ...
Selecting previously unselected package libzmq3-dev:amd64.
Preparing to unpack .../13-libzmq3-dev_4.3.1-4+deb10u2_amd64.deb ...
Unpacking libzmq3-dev:amd64 (4.3.1-4+deb10u2) ...
Setting up libnorm1:amd64 (1.5.8+dfsg2-1) ...
Setting up libnorm-dev:amd64 (1.5.8+dfsg2-1) ...
Setting up libgssrpc4:amd64 (1.17-3+deb10u1) ...
Setting up comerr-dev:amd64 (2.1-1.44.5-1+deb10u3) ...
Setting up libsodium-dev:amd64 (1.0.17-1) ...
Setting up libkdb5-9:amd64 (1.17-3+deb10u1) ...
Setting up libkadm5srv-mit11:amd64 (1.17-3+deb10u1) ...
Setting up libpgm-5.2-0:amd64 (5.2.122~dfsg-3) ...
Setting up libkadm5clnt-mit11:amd64 (1.17-3+deb10u1) ...
Setting up libzmq5:amd64 (4.3.1-4+deb10u2) ...
Setting up libpgm-dev:amd64 (5.2.122~dfsg-3) ...
Setting up krb5-multidev:amd64 (1.17-3+deb10u1) ...
Setting up libkrb5-dev:amd64 (1.17-3+deb10u1) ...
Setting up libzmq3-dev:amd64 (4.3.1-4+deb10u2) ...
Processing triggers for libc-bin (2.28-10) ...
Removing intermediate container 1ad591e5db41
---> c347898dd6f3
Step 4/4 : RUN pecl install --force zmq && pecl run-tests zmq
---> Running in 454c5a4ef3d8
WARNING: failed to download pecl.php.net/zmq within preferred state "stable", will instead download version 1.1.3, stability "beta"
downloading zmq-1.1.3.tgz ...
Starting to download zmq-1.1.3.tgz (82,397 bytes)
.
.
.
.
.
.
.
.
.
.
.
.
.
.
.
.
.
...done: 82,397 bytes
24 source files, building
running: phpize
Configuring for:
PHP Api Version:         20180731
Zend Module Api No:      20180731
Zend Extension Api No:   320180731
Please provide the prefix of libzmq installation
[autodetect]
:
building in /tmp/pear/temp/pear-build-defaultuser9r98KC/zmq-1.1.3
running: /tmp/pear/temp/zmq/configure --with-php-config=/usr/local/bin/php-config --with-zmq
checking for grep that handles long lines and -e... /bin/grep
checking for egrep... /bin/grep -E
checking for a sed that does not truncate output... /bin/sed
checking for cc... cc
checking whether the C compiler works... yes
checking for C compiler default output file name... a.out
checking for suffix of executables...
checking whether we are cross compiling... no
checking for suffix of object files... o
checking whether we are using the GNU C compiler... yes
checking whether cc accepts -g... yes
checking for cc option to accept ISO C89... none needed
checking how to run the C preprocessor... cc -E
checking for icc... no
checking for suncc... no
checking whether cc understands -c and -o together... yes
checking for system library directory... lib
checking if compiler supports -R... no
checking if compiler supports -Wl,-rpath,... yes
checking build system type... x86_64-pc-linux-gnu
checking host system type... x86_64-pc-linux-gnu
checking target system type... x86_64-pc-linux-gnu
checking for PHP prefix... /usr/local
checking for PHP includes... -I/usr/local/include/php -I/usr/local/include/php/main -I/usr/local/include/php/TSRM -I/usr/local/include/php/Zend -I/usr/local/include/php/ext -I/usr/local/include/php/ext/date/lib
checking for PHP extension directory... /usr/local/lib/php/extensions/no-debug-zts-20180731
checking for PHP installed headers prefix... /usr/local/include/php
checking if debug is enabled... no
checking if zts is enabled... yes
checking for re2c... re2c
checking for re2c version... 1.1.1 (ok)
checking for gawk... no
checking for nawk... nawk
checking if nawk is broken... no
checking whether to enable 0MQ support... yes, shared
checking whether to enable CZMQ support... no
checking for pkg-config... /usr/bin/pkg-config
checking libzmq installation... found version 4.3.1, under /usr
checking for zmq_socket_monitor in -lzmq... yes
checking for zmq_proxy_steerable in -lzmq... yes
checking for zmq_z85_decode in -lzmq... yes
checking for zmq_curve_keypair in -lzmq... yes
checking for zmq_ctx_get in -lzmq... yes
checking for zmq_unbind in -lzmq... yes
checking for zmq_disconnect in -lzmq... yes
checking for ANSI C header files... yes
checking for sys/types.h... yes
checking for sys/stat.h... yes
checking for stdlib.h... yes
checking for string.h... yes
checking for memory.h... yes
checking for strings.h... yes
checking for inttypes.h... yes
checking for stdint.h... yes
checking for unistd.h... yes
checking for stdint.h... (cached) yes
checking time.h usability... yes
checking time.h presence... yes
checking for time.h... yes
checking sys/time.h usability... yes
checking sys/time.h presence... yes
checking for sys/time.h... yes
checking mach/mach_time.h usability... no
checking mach/mach_time.h presence... no
checking for mach/mach_time.h... no
checking for library containing clock_gettime... none required
checking for clock_gettime... yes
checking for gettimeofday... yes
checking for mach_absolute_time... no
checking for ld used by cc... /usr/bin/ld
checking if the linker (/usr/bin/ld) is GNU ld... yes
checking for /usr/bin/ld option to reload object files... -r
checking for BSD-compatible nm... /usr/bin/nm -B
checking whether ln -s works... yes
checking how to recognize dependent libraries... pass_all
checking dlfcn.h usability... yes
checking dlfcn.h presence... yes
checking for dlfcn.h... yes
checking the maximum length of command line arguments... 1572864
checking command to parse /usr/bin/nm -B output from cc object... ok
checking for objdir... .libs
checking for ar... ar
checking for ranlib... ranlib
checking for strip... strip
checking if cc supports -fno-rtti -fno-exceptions... no
checking for cc option to produce PIC... -fPIC
checking if cc PIC flag -fPIC works... yes
checking if cc static flag -static works... yes
checking if cc supports -c -o file.o... yes
checking whether the cc linker (/usr/bin/ld -m elf_x86_64) supports shared libraries... yes
checking whether -lc should be explicitly linked in... no
checking dynamic linker characteristics... GNU/Linux ld.so
checking how to hardcode library paths into programs... immediate
checking whether stripping libraries is possible... yes
checking if libtool supports shared libraries... yes
checking whether to build shared libraries... yes
checking whether to build static libraries... no
creating libtool
appending configuration tag "CXX" to libtool
configure: creating ./config.status
config.status: creating config.h
running: make
/bin/bash /tmp/pear/temp/pear-build-defaultuser9r98KC/zmq-1.1.3/libtool --mode=compile cc  -I. -I/tmp/pear/temp/zmq -DPHP_ATOM_INC -I/tmp/pear/temp/pear-build-defaultuser9r98KC/zmq-1.1.3/include -I/tmp/pear/temp/pear-build-defaultuser9r98KC/zmq-1.1.3/main -I/tmp/pear/temp/zmq -I/usr/local/include/php -I/usr/local/include/php/main -I/usr/local/include/php/TSRM -I/usr/local/include/php/Zend -I/usr/local/include/php/ext -I/usr/local/include/php/ext/date/lib -I/usr/include/pgm-5.2  -DHAVE_CONFIG_H  -g -O2   -c /tmp/pear/temp/zmq/zmq.c -o zmq.lo
mkdir .libs
cc -I. -I/tmp/pear/temp/zmq -DPHP_ATOM_INC -I/tmp/pear/temp/pear-build-defaultuser9r98KC/zmq-1.1.3/include -I/tmp/pear/temp/pear-build-defaultuser9r98KC/zmq-1.1.3/main -I/tmp/pear/temp/zmq -I/usr/local/include/php -I/usr/local/include/php/main -I/usr/local/include/php/TSRM -I/usr/local/include/php/Zend -I/usr/local/include/php/ext -I/usr/local/include/php/ext/date/lib -I/usr/include/pgm-5.2 -DHAVE_CONFIG_H -g -O2 -c /tmp/pear/temp/zmq/zmq.c  -fPIC -DPIC -o .libs/zmq.o
/tmp/pear/temp/zmq/zmq.c: In function 'php_zmq_context_get':
/tmp/pear/temp/zmq/zmq.c:238:20: error: lvalue required as left operand of assignment
GC_REFCOUNT(&le) = 1;
^
/tmp/pear/temp/zmq/zmq.c: In function 'php_zmq_socket_store':
/tmp/pear/temp/zmq/zmq.c:538:19: error: lvalue required as left operand of assignment
GC_REFCOUNT(&le) = 1;
^
make: *** [Makefile:194: zmq.lo] Error 1
ERROR: `make' failed